BDBM533 (3S,4R)-4-methyl-1,1-dioxo--thiolan-3-yl N-[(2S,3R)-4-[(3S,4aS,8aS)-3-(tert-butylcarbamoyl)-decahydroisoquinolin-2-yl]-3-hydroxy-1-phenylbutan-2-yl]carbamate::Isoquinoline furanyl urethane analog::Sulfone deriv. 27
SMILES [H][C@]12CCCC[C@@]1([H])C[C@]([H])(N(C[C@@H](O)[C@H](Cc1ccccc1)NC(=O)O[C@@H]1CS(=O)(=O)C[C@@H]1C)C2)C(=O)NC(C)(C)C
InChI Key InChIKey=JGNJWIIHVZPCLO-ITASEOMLSA-N
Data  1 IC50
  Tab Delimited (TSV)   2D SDfile   Computed 3D by Vconf -m prep SDfile
Find this compound or compounds like it in BindingDB:
Activity Spreadsheet -- Enzyme Inhibition Constant Data from BindingDB
Found 1 hit for monomerid = 533
TargetDimer of Gag-Pol polyprotein [489-587](Human immunodeficiency virus type 1)
Merck Research Laboratories
LigandPNGBDBM533((3S,4R)-4-methyl-1,1-dioxo--thiolan-3-yl N-[(2S,3R...)
Affinity DataIC50:  70nMpH: 5.5 T: 2°C. Assay description: The IC50 values for the compounds were determined using purified HIV-1 Protease. Inhibition of the cleavage of the peptide H-Val-Ser-Gln-Asn-(L-beta-...
In DepthDetails ArticlePubMed