BDBM53330 (5-bromanylthiophen-2-yl)-(4-pyridin-2-ylpiperazin-1-yl)methanone::(5-bromo-2-thienyl)-[4-(2-pyridyl)piperazino]methanone::(5-bromo-2-thiophenyl)-[4-(2-pyridinyl)-1-piperazinyl]methanone::(5-bromothiophen-2-yl)-(4-pyridin-2-ylpiperazin-1-yl)methanone::MLS001223739::SMR000679670::cid_1246464
SMILES Brc1ccc(s1)C(=O)N1CCN(CC1)c1ccccn1
InChI Key InChIKey=IUEZDGHTYJEUOZ-UHFFFAOYSA-N
Data  2 EC50
  Tab Delimited (TSV)   2D SDfile   Computed 3D by Vconf -m prep SDfile
Find this compound or compounds like it in BindingDB:
Activity Spreadsheet -- Enzyme Inhibition Constant Data from BindingDB
Found 2 hits for monomerid = 53330
TargetZinc finger protein mex-5(Caenorhabditis elegans)
Broad Institute
Curated by PubChem BioAssay
LigandPNGBDBM53330((5-bromanylthiophen-2-yl)-(4-pyridin-2-ylpiperazin...)
Affinity DataEC50:  3.00E+5nM. Assay description: Broad Institute: MLPCN maternal gene expression Project ID: 2024 Keywords: Zinc finger, C. elegans, maternal gene expression, RNA-protein interac...
In DepthDetails PCBioAssay
TargetPOsterior Segregation(Caenorhabditis elegans)
Broad Institute
Curated by PubChem BioAssay
LigandPNGBDBM53330((5-bromanylthiophen-2-yl)-(4-pyridin-2-ylpiperazin...)
Affinity DataEC50:  3.00E+5nM. Assay description: Broad Institute: MLPCN maternal gene expression Project ID: 2024 Keywords: Zinc finger, C. elegans, maternal gene expression, RNA-protein interac...
In DepthDetails PCBioAssay