BDBM53468 2-[3-cyano-4-(2-methoxyphenyl)-6-phenyl-pyridin-2-yl]sulfanylethanoic acid::2-[3-cyano-4-(2-methoxyphenyl)-6-phenylpyridin-2-yl]sulfanylacetic acid::2-[[3-cyano-4-(2-methoxyphenyl)-6-phenyl-2-pyridinyl]thio]acetic acid::2-[[3-cyano-4-(2-methoxyphenyl)-6-phenyl-2-pyridyl]thio]acetic acid::MLS001203461::O-acyl oxime isatin derivative, 51::SMR000516574::[3-Cyano-4-(2-methoxy-phenyl)-6-phenyl-pyridin-2-ylsulfanyl]-acetic acid::cid_1049793
SMILES COc1ccccc1-c1cc(nc(SCC(O)=O)c1C#N)-c1ccccc1
InChI Key InChIKey=HXHZNFAFHFRUIE-UHFFFAOYSA-N
Data  2 IC50  1 EC50
  Tab Delimited (TSV)   2D SDfile   Computed 3D by Vconf -m prep SDfile
Find this compound or compounds like it in BindingDB:
Activity Spreadsheet -- Enzyme Inhibition Constant Data from BindingDB
Found 3 hits for monomerid = 53468
TargetUbiquitin carboxyl-terminal hydrolase isozyme L1(Mus musculus (Mouse))
Brigham And Women'S Hospital
LigandPNGBDBM53468(2-[3-cyano-4-(2-methoxyphenyl)-6-phenyl-pyridin-2-...)
Affinity DataIC50:  940nMpH: 7.6 T: 2°C. Assay description: Inhibition activity and selectivity for UCH-L1 and UCH-L3.
In DepthDetails ArticlePubMed
TargetStreptokinase A(Streptococcus pyogenes M1 GAS)
Broad Institute
Curated by PubChem BioAssay
LigandPNGBDBM53468(2-[3-cyano-4-(2-methoxyphenyl)-6-phenyl-pyridin-2-...)
Affinity DataEC50:  1.72E+3nM. Assay description: Keywords: Group A streptococcus, GAS, streptokinase, expression, virulence, inhibition, dose response, EC50 Assay Overview: The goal of this assa...
In DepthDetails PCBioAssay
TargetUbiquitin carboxyl-terminal hydrolase isozyme L3(Mus musculus (Mouse))
Brigham And Women'S Hospital
LigandPNGBDBM53468(2-[3-cyano-4-(2-methoxyphenyl)-6-phenyl-pyridin-2-...)
Affinity DataIC50:  2.30E+4nMpH: 7.6 T: 2°C. Assay description: Inhibition activity and selectivity for UCH-L1 and UCH-L3.
In DepthDetails ArticlePubMed