BDBM53660 2-Imino-1-(3-methoxy-propyl)-8-methyl-10-oxo-1,10-dihydro-2H-1,9,10a-triaza-anthracene-3-carboxylic acid (tetrahydro-furan-2-ylmethyl)-amide::2-azanylidene-1-(3-methoxypropyl)-10-methyl-5-oxidanylidene-N-(oxolan-2-ylmethyl)dipyrido[3,4-c:1',2'-f]pyrimidine-3-carboxamide::2-imino-1-(3-methoxypropyl)-10-methyl-5-oxo-N-(2-oxolanylmethyl)-3-dipyrido[3,4-c:1',2'-f]pyrimidinecarboxamide::2-imino-1-(3-methoxypropyl)-10-methyl-5-oxo-N-(oxolan-2-ylmethyl)dipyrido[3,4-c:1',2'-f]pyrimidine-3-carboxamide::2-imino-5-keto-1-(3-methoxypropyl)-10-methyl-N-(tetrahydrofurfuryl)dipyrido[3,4-c:1',2'-f]pyrimidine-3-carboxamide::MLS000073190::SMR000013129::cid_653959
SMILES COCCCn1c2nc3c(C)cccn3c(=O)c2cc(C(=O)NCC2CCCO2)c1=N
InChI Key InChIKey=DSKYCKXZSYCMMV-UHFFFAOYSA-N
Data  1 IC50
  Tab Delimited (TSV)   2D SDfile   Computed 3D by Vconf -m prep SDfile
Find this compound or compounds like it in BindingDB:
Activity Spreadsheet -- Enzyme Inhibition Constant Data from BindingDB
Found 1 hit for monomerid = 53660
TargetM1 family aminopeptidase(Plasmodium falciparum (isolate FcB1 / Columbia))
Srmlsc
Curated by PubChem BioAssay
LigandPNGBDBM53660(2-Imino-1-(3-methoxy-propyl)-8-methyl-10-oxo-1,10-...)
Affinity DataIC50:  7.84E+4nM. Assay description: Southern Research Molecular Libraries Screening Center (SRMLSC) Southern Research Institute (Birmingham, Alabama) NIH Molecular Libraries Screening...
In DepthDetails PCBioAssay