BDBM53818 (6Z)-5-azanylidene-3-methylsulfonyl-6-[(5-phenylfuran-2-yl)methylidene]-[1,2,4]thiadiazolo[4,5-a]pyrimidin-7-one::(6Z)-5-imino-3-(methylsulfonyl)-6-[(5-phenyl-2-furyl)methylene]-5,6-dihydro-7H-[1,2,4]thiadiazolo[4,5-a]pyrimidin-7-one::(6Z)-5-imino-3-mesyl-6-[(5-phenyl-2-furyl)methylene]-[1,2,4]thiadiazolo[4,5-a]pyrimidin-7-one::(6Z)-5-imino-3-methylsulfonyl-6-[(5-phenyl-2-furanyl)methylidene]-[1,2,4]thiadiazolo[4,5-a]pyrimidin-7-one::(6Z)-5-imino-3-methylsulfonyl-6-[(5-phenylfuran-2-yl)methylidene]-[1,2,4]thiadiazolo[4,5-a]pyrimidin-7-one::MLS000583141::SMR000206327::cid_12005345
SMILES CS(=O)(=O)C1=NSC2=NC(=O)\C(=C/c3ccc(o3)-c3ccccc3)C(=N)N12
InChI Key InChIKey=YPSCEFIJMNAXKT-LITBSJMGSA-N
Data  1 IC50
  Tab Delimited (TSV)   2D SDfile   Computed 3D by Vconf -m prep SDfile
Find this compound or compounds like it in BindingDB:
Activity Spreadsheet -- Enzyme Inhibition Constant Data from BindingDB
Found 1 hit for monomerid = 53818
TargetM1 family aminopeptidase(Plasmodium falciparum (isolate FcB1 / Columbia))
Srmlsc
Curated by PubChem BioAssay
LigandPNGBDBM53818((6Z)-5-azanylidene-3-methylsulfonyl-6-[(5-phenylfu...)
Affinity DataIC50:  7.11E+4nM. Assay description: Southern Research Molecular Libraries Screening Center (SRMLSC) Southern Research Institute (Birmingham, Alabama) NIH Molecular Libraries Screening...
In DepthDetails PCBioAssay