BDBM53876 5-(6-amino-5-methyl-3-pyridinyl)-2-thiophenecarboxylic acid::5-(6-amino-5-methyl-3-pyridyl)-2-thenoic acid::5-(6-amino-5-methylpyridin-3-yl)thiophene-2-carboxylic acid::5-(6-azanyl-5-methyl-pyridin-3-yl)thiophene-2-carboxylic acid::MLS000685990::SMR000324862::cid_2052640
SMILES Cc1cc(cnc1N)-c1ccc(s1)C(O)=O
InChI Key InChIKey=RHGPTOUJLXZQEP-UHFFFAOYSA-N
Data  1 IC50
  Tab Delimited (TSV)   2D SDfile   Computed 3D by Vconf -m prep SDfile
Find this compound or compounds like it in BindingDB:
Activity Spreadsheet -- Enzyme Inhibition Constant Data from BindingDB
Found 1 hit for monomerid = 53876
TargetM1 family aminopeptidase(Plasmodium falciparum (isolate FcB1 / Columbia))
Srmlsc
Curated by PubChem BioAssay
LigandPNGBDBM53876(5-(6-amino-5-methyl-3-pyridinyl)-2-thiophenecarbox...)
Affinity DataIC50:  5.89E+4nM. Assay description: Southern Research Molecular Libraries Screening Center (SRMLSC) Southern Research Institute (Birmingham, Alabama) NIH Molecular Libraries Screening...
In DepthDetails PCBioAssay