BDBM53888 CHEMBL1505807::MLS000685523::N'-(1,1-dioxido-1,2-benzisothiazol-3-yl)-2,4-dimethylbenzenesulfonohydrazide::N''''-(1,1-diketo-1,2-benzothiazol-3-yl)-2,4-dimethyl-benzenesulfonohydrazide::N''''-(1,1-dioxo-1,2-benzothiazol-3-yl)-2,4-dimethylbenzenesulfonohydrazide::N''''-[1,1-bis(oxidanylidene)-1,2-benzothiazol-3-yl]-2,4-dimethyl-benzenesulfonohydrazide::N'-(1,1-diketo-1,2-benzothiazol-3-yl)-2,4-dimethyl-benzenesulfonohydrazide::SMR000312487::cid_4683593
SMILES Cc1ccc(c(C)c1)S(=O)(=O)NN=C1NS(=O)(=O)c2ccccc12
InChI Key InChIKey=QARULBNZWNDVPO-UHFFFAOYSA-N
Data  2 IC50
  Tab Delimited (TSV)   2D SDfile   Computed 3D by Vconf -m prep SDfile
Find this compound or compounds like it in BindingDB:
Activity Spreadsheet -- Enzyme Inhibition Constant Data from BindingDB
Found 2 hits for monomerid = 53888
TargetAminopeptidase N(Sus scrofa (Pig))
Shandong Academy Of Sciences
Curated by ChEMBL
LigandPNGBDBM53888(CHEMBL1505807 | MLS000685523 | N'-(1,1-dioxido...)
Affinity DataIC50:  8.28E+5nM. Assay description: Inhibition of porcine kidney microsome aminopeptidase using L-Leu-p-nitroanilide as substrate after 30 mins
In DepthDetails ArticlePubMed
TargetM1 family aminopeptidase(Plasmodium falciparum (isolate FcB1 / Columbia))
Srmlsc
Curated by PubChem BioAssay
LigandPNGBDBM53888(CHEMBL1505807 | MLS000685523 | N'-(1,1-dioxido...)
Affinity DataIC50:  9.97E+3nM. Assay description: Southern Research Molecular Libraries Screening Center (SRMLSC) Southern Research Institute (Birmingham, Alabama) NIH Molecular Libraries Screening...
In DepthDetails PCBioAssay