BDBM53956 MLS000856388::N-[1-(benzoxymethyl)-2-[(1-carbazoyl-3-methyl-butyl)amino]-2-keto-ethyl]carbamic acid tert-butyl ester::N-[1-[(1-hydrazinyl-4-methyl-1-oxopentan-2-yl)amino]-1-oxo-3-phenylmethoxypropan-2-yl]carbamic acid tert-butyl ester::SMR000279333::cid_3103019::tert-butyl N-[1-[(1-diazanyl-4-methyl-1-oxidanylidene-pentan-2-yl)amino]-1-oxidanylidene-3-phenylmethoxy-propan-2-yl]carbamate::tert-butyl N-[1-[(1-hydrazinyl-4-methyl-1-oxopentan-2-yl)amino]-1-oxo-3-phenylmethoxypropan-2-yl]carbamate
SMILES CC(C)CC(NC(=O)C(COCc1ccccc1)NC(=O)OC(C)(C)C)C(=O)NN
InChI Key InChIKey=IYCZMJMNVSEOOM-UHFFFAOYSA-N
Data  1 IC50
  Tab Delimited (TSV)   2D SDfile   Computed 3D by Vconf -m prep SDfile
Find this compound or compounds like it in BindingDB:
Activity Spreadsheet -- Enzyme Inhibition Constant Data from BindingDB
Found 1 hit for monomerid = 53956
TargetM1 family aminopeptidase(Plasmodium falciparum (isolate FcB1 / Columbia))
Srmlsc
Curated by PubChem BioAssay
LigandPNGBDBM53956(MLS000856388 | N-[1-(benzoxymethyl)-2-[(1-carbazoy...)
Affinity DataIC50:  8.14E+4nM. Assay description: Southern Research Molecular Libraries Screening Center (SRMLSC) Southern Research Institute (Birmingham, Alabama) NIH Molecular Libraries Screening...
In DepthDetails PCBioAssay