BDBM53968 2-[2-[[1-(3,4-dimethylphenyl)-1,2,3,4-tetrazol-5-yl]sulfanyl]ethanoylamino]-2,2-diphenyl-ethanoic acid::2-[[2-[1-(3,4-dimethylphenyl)tetrazol-5-yl]sulfanylacetyl]amino]-2,2-diphenylacetic acid::2-[[2-[[1-(3,4-dimethylphenyl)-5-tetrazolyl]thio]-1-oxoethyl]amino]-2,2-diphenylacetic acid::2-[[2-[[1-(3,4-dimethylphenyl)tetrazol-5-yl]thio]acetyl]amino]-2,2-diphenyl-acetic acid::MLS000862400::SMR000300846::[({[1-(3,4-dimethylphenyl)-1H-tetrazol-5-yl]thio}acetyl)amino](diphenyl)acetic acid::cid_1250233
SMILES Cc1ccc(cc1C)-n1nnnc1SCC(=O)NC(C(O)=O)(c1ccccc1)c1ccccc1
InChI Key InChIKey=DMUCDHKIUOLCQD-UHFFFAOYSA-N
Data  1 IC50
  Tab Delimited (TSV)   2D SDfile   Computed 3D by Vconf -m prep SDfile
Find this compound or compounds like it in BindingDB:
Activity Spreadsheet -- Enzyme Inhibition Constant Data from BindingDB
Found 1 hit for monomerid = 53968
TargetM1 family aminopeptidase(Plasmodium falciparum (isolate FcB1 / Columbia))
Srmlsc
Curated by PubChem BioAssay
LigandPNGBDBM53968(2-[2-[[1-(3,4-dimethylphenyl)-1,2,3,4-tetrazol-5-y...)
Affinity DataIC50:  2.92E+4nM. Assay description: Southern Research Molecular Libraries Screening Center (SRMLSC) Southern Research Institute (Birmingham, Alabama) NIH Molecular Libraries Screening...
In DepthDetails PCBioAssay