BDBM54036 MLS000773703::N-[2-(diethylamino)-5-(diethylsulfamoyl)phenyl]-3-pyridinecarboxamide::N-[2-(diethylamino)-5-(diethylsulfamoyl)phenyl]nicotinamide::N-[2-(diethylamino)-5-(diethylsulfamoyl)phenyl]pyridine-3-carboxamide::SMR000364406::cid_4539779
SMILES CCN(CC)c1ccc(cc1NC(=O)c1cccnc1)S(=O)(=O)N(CC)CC
InChI Key InChIKey=LIQFJUFBFZNHHP-UHFFFAOYSA-N
Data  1 IC50
  Tab Delimited (TSV)   2D SDfile   Computed 3D by Vconf -m prep SDfile
Find this compound or compounds like it in BindingDB:
Activity Spreadsheet -- Enzyme Inhibition Constant Data from BindingDB
Found 1 hit for monomerid = 54036
TargetM1 family aminopeptidase(Plasmodium falciparum (isolate FcB1 / Columbia))
Srmlsc
Curated by PubChem BioAssay
LigandPNGBDBM54036(MLS000773703 | N-[2-(diethylamino)-5-(diethylsulfa...)
Affinity DataIC50:  2.85E+4nM. Assay description: Southern Research Molecular Libraries Screening Center (SRMLSC) Southern Research Institute (Birmingham, Alabama) NIH Molecular Libraries Screening...
In DepthDetails PCBioAssay