BDBM54248 (4E)-5-methyl-4-[[(2-methyl-8-quinolinyl)amino]methylidene]-2-phenyl-3-pyrazolone::(4E)-5-methyl-4-[[(2-methyl-8-quinolyl)amino]methylene]-2-phenyl-2-pyrazolin-3-one::(4E)-5-methyl-4-[[(2-methylquinolin-8-yl)amino]methylidene]-2-phenyl-pyrazol-3-one::(4E)-5-methyl-4-[[(2-methylquinolin-8-yl)amino]methylidene]-2-phenylpyrazol-3-one::5-Methyl-4-[1-(2-methyl-quinolin-8-ylamino)-meth-(Z)-ylidene]-2-phenyl-2,4-dihydro-pyrazol-3-one::MLS000590100::SMR000219254::cid_5396454
SMILES Cc1[nH]n(-c2ccccc2)c(=O)c1C=Nc1cccc2ccc(C)nc12
InChI Key InChIKey=OKVVSJSJFPXEJA-UHFFFAOYSA-N
Data  5 IC50  1 EC50
  Tab Delimited (TSV)   2D SDfile   Computed 3D by Vconf -m prep SDfile
Find this compound or compounds like it in BindingDB:
Activity Spreadsheet -- Enzyme Inhibition Constant Data from BindingDB
Found 6 hits for monomerid = 54248
TargetNucleotide-binding oligomerization domain-containing protein 2(Homo sapiens (Human))
Burnham Center For Chemical Genomics
Curated by PubChem BioAssay
LigandPNGBDBM54248((4E)-5-methyl-4-[[(2-methyl-8-quinolinyl)amino]met...)
Affinity DataIC50:  7.67E+3nM. Assay description: Data Source: Sanford-Burnham Center for Chemical Genomics (SBCCG) Source Affiliation: Sanford-Burnham Medical Research Institute (SBMRI, San Diego, C...
In DepthDetails PCBioAssay
TargetNucleotide-binding oligomerization domain-containing protein 1(Homo sapiens (Human))
Burnham Center For Chemical Genomics
Curated by PubChem BioAssay
LigandPNGBDBM54248((4E)-5-methyl-4-[[(2-methyl-8-quinolinyl)amino]met...)
Affinity DataEC50:  4.72E+3nM. Assay description: Data Source: Sanford-Burnham Center for Chemical Genomics (SBCCG) Source Affiliation: Sanford-Burnham Medical Research Institute (SBMRI, San Diego, C...
In DepthDetails PCBioAssay
TargetTumor necrosis factor(Homo sapiens (Human))
Burnham Center For Chemical Genomics
Curated by PubChem BioAssay
LigandPNGBDBM54248((4E)-5-methyl-4-[[(2-methyl-8-quinolinyl)amino]met...)
Affinity DataIC50:  2.00E+4nM. Assay description: Data Source: Sanford-Burnham Center for Chemical Genomics (SBCCG) Source Affiliation: Sanford-Burnham Medical Research Institute (SBMRI, San Diego, C...
In DepthDetails PCBioAssay
TargetNucleotide-binding oligomerization domain-containing protein 2(Homo sapiens (Human))
Burnham Center For Chemical Genomics
Curated by PubChem BioAssay
LigandPNGBDBM54248((4E)-5-methyl-4-[[(2-methyl-8-quinolinyl)amino]met...)
Affinity DataIC50:  2.00E+4nM. Assay description: Data Source: Sanford-Burnham Center for Chemical Genomics (SBCCG) Source Affiliation: Sanford-Burnham Medical Research Institute (SBMRI, San Diego, C...
In DepthDetails PCBioAssay
TargetTumor necrosis factor(Homo sapiens (Human))
Burnham Center For Chemical Genomics
Curated by PubChem BioAssay
LigandPNGBDBM54248((4E)-5-methyl-4-[[(2-methyl-8-quinolinyl)amino]met...)
Affinity DataIC50: >2.00E+4nM. Assay description: Data Source: Sanford-Burnham Center for Chemical Genomics (SBCCG) Source Affiliation: Sanford-Burnham Medical Research Institute (SBMRI, San Diego, C...
In DepthDetails PCBioAssay
TargetNucleotide-binding oligomerization domain-containing protein 1(Homo sapiens (Human))
Burnham Center For Chemical Genomics
Curated by PubChem BioAssay
LigandPNGBDBM54248((4E)-5-methyl-4-[[(2-methyl-8-quinolinyl)amino]met...)
Affinity DataIC50:  2.00E+4nM. Assay description: Data Source: Sanford-Burnham Center for Chemical Genomics (SBCCG) Source Affiliation: Sanford-Burnham Medical Research Institute (SBMRI, San Diego, C...
In DepthDetails PCBioAssay