BDBM54259 (2Z,3Z)-2-[4-(4-ethoxyphenyl)-3H-1,3-thiazol-2-ylidene]-3-(3-nitro-4-oxidanylidene-cyclohexa-2,5-dien-1-ylidene)propanenitrile::(2Z,3Z)-2-[4-(4-ethoxyphenyl)-3H-1,3-thiazol-2-ylidene]-3-(3-nitro-4-oxocyclohexa-2,5-dien-1-ylidene)propanenitrile::(2Z,3Z)-2-[4-(4-ethoxyphenyl)-3H-thiazol-2-ylidene]-3-(3-nitro-4-oxo-1-cyclohexa-2,5-dienylidene)propanenitrile::(2Z,3Z)-3-(4-keto-3-nitro-cyclohexa-2,5-dien-1-ylidene)-2-(4-p-phenetyl-4-thiazolin-2-ylidene)propionitrile::MLS000696955::SMR000237723::cid_15944671
SMILES CCOc1ccc(cc1)-c1csc([nH+]1)C(=C\[c-]1ccc(=O)c(c1)[N+]([O-])=O)\C#N
InChI Key InChIKey=MOXISCZUDYOVNA-OQLLNIDSSA-O
Data  2 IC50  1 EC50
  Tab Delimited (TSV)   2D SDfile   Computed 3D by Vconf -m prep SDfile
Find this compound or compounds like it in BindingDB:
Activity Spreadsheet -- Enzyme Inhibition Constant Data from BindingDB
Found 3 hits for monomerid = 54259
TargetNucleotide-binding oligomerization domain-containing protein 2(Homo sapiens (Human))
Burnham Center For Chemical Genomics
Curated by PubChem BioAssay
LigandPNGBDBM54259((2Z,3Z)-2-[4-(4-ethoxyphenyl)-3H-1,3-thiazol-2-yli...)
Affinity DataIC50:  2.59E+3nM. Assay description: Data Source: Sanford-Burnham Center for Chemical Genomics (SBCCG) Source Affiliation: Sanford-Burnham Medical Research Institute (SBMRI, San Diego, C...
In DepthDetails PCBioAssay
TargetTumor necrosis factor(Homo sapiens (Human))
Burnham Center For Chemical Genomics
Curated by PubChem BioAssay
LigandPNGBDBM54259((2Z,3Z)-2-[4-(4-ethoxyphenyl)-3H-1,3-thiazol-2-yli...)
Affinity DataIC50:  1.83E+3nM. Assay description: Data Source: Sanford-Burnham Center for Chemical Genomics (SBCCG) Source Affiliation: Sanford-Burnham Medical Research Institute (SBMRI, San Diego, C...
In DepthDetails PCBioAssay
TargetNucleotide-binding oligomerization domain-containing protein 1(Homo sapiens (Human))
Burnham Center For Chemical Genomics
Curated by PubChem BioAssay
LigandPNGBDBM54259((2Z,3Z)-2-[4-(4-ethoxyphenyl)-3H-1,3-thiazol-2-yli...)
Affinity DataEC50:  1.52E+3nM. Assay description: Data Source: Sanford-Burnham Center for Chemical Genomics (SBCCG) Source Affiliation: Sanford-Burnham Medical Research Institute (SBMRI, San Diego, C...
In DepthDetails PCBioAssay