BDBM54298 (2Z)-3-butyl-2-[(1-ethyl-2-quinolin-1-iumyl)methylidene]-1,3-benzothiazole;iodide::(2Z)-3-butyl-2-[(1-ethylquinolin-1-ium-2-yl)methylene]-1,3-benzothiazole;iodide::(2Z)-3-butyl-2-[(1-ethylquinolin-1-ium-2-yl)methylidene]-1,3-benzothiazole;iodide::MLS000678050::SMR000285913::cid_16188269
SMILES CCCCN1\C(Sc2ccccc12)=C\c1ccc2ccccc2[n+]1CC
InChI Key InChIKey=YSQZXXQOIHGWIS-UHFFFAOYSA-N
Data  3 IC50  1 EC50
  Tab Delimited (TSV)   2D SDfile   Computed 3D by Vconf -m prep SDfile
Find this compound or compounds like it in BindingDB:
Activity Spreadsheet -- Enzyme Inhibition Constant Data from BindingDB
Found 4 hits for monomerid = 54298
TargetNucleotide-binding oligomerization domain-containing protein 2(Homo sapiens (Human))
Burnham Center For Chemical Genomics
Curated by PubChem BioAssay
LigandPNGBDBM54298((2Z)-3-butyl-2-[(1-ethyl-2-quinolin-1-iumyl)methyl...)
Affinity DataIC50:  1.95E+3nM. Assay description: Data Source: Sanford-Burnham Center for Chemical Genomics (SBCCG) Source Affiliation: Sanford-Burnham Medical Research Institute (SBMRI, San Diego, C...
In DepthDetails PCBioAssay
TargetMitochondrial import inner membrane translocase subunit TIM10(Saccharomyces cerevisiae S288c)
Burnham Center For Chemical Genomics
Curated by PubChem BioAssay
LigandPNGBDBM54298((2Z)-3-butyl-2-[(1-ethyl-2-quinolin-1-iumyl)methyl...)
Affinity DataIC50:  1.92E+4nM. Assay description: Data Source: Sanford-Burnham Center for Chemical Genomics (SBCCG) Source Affiliation: Sanford-Burnham Medical Research Institute(SBMRI, San Diego, CA...
In DepthDetails PCBioAssay
TargetTumor necrosis factor(Homo sapiens (Human))
Burnham Center For Chemical Genomics
Curated by PubChem BioAssay
LigandPNGBDBM54298((2Z)-3-butyl-2-[(1-ethyl-2-quinolin-1-iumyl)methyl...)
Affinity DataIC50:  1.96E+3nM. Assay description: Data Source: Sanford-Burnham Center for Chemical Genomics (SBCCG) Source Affiliation: Sanford-Burnham Medical Research Institute (SBMRI, San Diego, C...
In DepthDetails PCBioAssay
TargetNucleotide-binding oligomerization domain-containing protein 1(Homo sapiens (Human))
Burnham Center For Chemical Genomics
Curated by PubChem BioAssay
LigandPNGBDBM54298((2Z)-3-butyl-2-[(1-ethyl-2-quinolin-1-iumyl)methyl...)
Affinity DataEC50:  2.17E+3nM. Assay description: Data Source: Sanford-Burnham Center for Chemical Genomics (SBCCG) Source Affiliation: Sanford-Burnham Medical Research Institute (SBMRI, San Diego, C...
In DepthDetails PCBioAssay