BDBM54483 3-fluoranyl-N-[5-[(4-methoxyphenyl)methyl-methyl-sulfamoyl]-1,3,4-thiadiazol-2-yl]benzamide::3-fluoro-N-[5-[(4-methoxyphenyl)methyl-methylsulfamoyl]-1,3,4-thiadiazol-2-yl]benzamide::3-fluoro-N-[5-[methyl(p-anisyl)sulfamoyl]-1,3,4-thiadiazol-2-yl]benzamide::MLS001116643::SMR000629937::cid_20921615
SMILES COc1ccc(CN(C)S(=O)(=O)c2nnc(NC(=O)c3cccc(F)c3)s2)cc1
InChI Key InChIKey=NYFTWOGVSSOLQI-UHFFFAOYSA-N
Data  4 IC50  1 EC50
  Tab Delimited (TSV)   2D SDfile   Computed 3D by Vconf -m prep SDfile
Find this compound or compounds like it in BindingDB:
Activity Spreadsheet -- Enzyme Inhibition Constant Data from BindingDB
Found 5 hits for monomerid = 54483
TargetNucleotide-binding oligomerization domain-containing protein 2(Homo sapiens (Human))
Burnham Center For Chemical Genomics
Curated by PubChem BioAssay
LigandPNGBDBM54483(3-fluoranyl-N-[5-[(4-methoxyphenyl)methyl-methyl-s...)
Affinity DataIC50:  1.23E+4nM. Assay description: Data Source: Sanford-Burnham Center for Chemical Genomics (SBCCG) Source Affiliation: Sanford-Burnham Medical Research Institute (SBMRI, San Diego, C...
In DepthDetails PCBioAssay
TargetNucleotide-binding oligomerization domain-containing protein 1(Homo sapiens (Human))
Burnham Center For Chemical Genomics
Curated by PubChem BioAssay
LigandPNGBDBM54483(3-fluoranyl-N-[5-[(4-methoxyphenyl)methyl-methyl-s...)
Affinity DataEC50:  1.80E+3nM. Assay description: Data Source: Sanford-Burnham Center for Chemical Genomics (SBCCG) Source Affiliation: Sanford-Burnham Medical Research Institute (SBMRI, San Diego, C...
In DepthDetails PCBioAssay
TargetTumor necrosis factor(Homo sapiens (Human))
Burnham Center For Chemical Genomics
Curated by PubChem BioAssay
LigandPNGBDBM54483(3-fluoranyl-N-[5-[(4-methoxyphenyl)methyl-methyl-s...)
Affinity DataIC50:  8.03E+3nM. Assay description: Data Source: Sanford-Burnham Center for Chemical Genomics (SBCCG) Source Affiliation: Sanford-Burnham Medical Research Institute (SBMRI, San Diego, C...
In DepthDetails PCBioAssay
TargetNucleotide-binding oligomerization domain-containing protein 1(Homo sapiens (Human))
Burnham Center For Chemical Genomics
Curated by PubChem BioAssay
LigandPNGBDBM54483(3-fluoranyl-N-[5-[(4-methoxyphenyl)methyl-methyl-s...)
Affinity DataIC50:  6.74E+3nM. Assay description: Data Source: Sanford-Burnham Center for Chemical Genomics (SBCCG) Source Affiliation: Sanford-Burnham Medical Research Institute (SBMRI, San Diego, C...
In DepthDetails PCBioAssay
TargetTumor necrosis factor(Homo sapiens (Human))
Burnham Center For Chemical Genomics
Curated by PubChem BioAssay
LigandPNGBDBM54483(3-fluoranyl-N-[5-[(4-methoxyphenyl)methyl-methyl-s...)
Affinity DataIC50:  1.71E+4nM. Assay description: Data Source: Sanford-Burnham Center for Chemical Genomics (SBCCG) Source Affiliation: Sanford-Burnham Medical Research Institute (SBMRI, San Diego, C...
In DepthDetails PCBioAssay