BDBM54531 2-(2-keto-4-phenyl-chromen-7-yl)oxy-N-(3-pyridyl)acetamide::2-(2-oxidanylidene-4-phenyl-chromen-7-yl)oxy-N-pyridin-3-yl-ethanamide::2-(2-oxo-4-phenylchromen-7-yl)oxy-N-pyridin-3-ylacetamide::2-[(2-oxo-4-phenyl-1-benzopyran-7-yl)oxy]-N-(3-pyridinyl)acetamide::MLS001160511::SMR000652637::cid_17583746
SMILES O=C(COc1ccc2c(cc(=O)oc2c1)-c1ccccc1)Nc1cccnc1
InChI Key InChIKey=YORPBKORBDTJQU-UHFFFAOYSA-N
Data  4 IC50  1 EC50
  Tab Delimited (TSV)   2D SDfile   Computed 3D by Vconf -m prep SDfile
Find this compound or compounds like it in BindingDB:
Activity Spreadsheet -- Enzyme Inhibition Constant Data from BindingDB
Found 5 hits for monomerid = 54531
TargetNucleotide-binding oligomerization domain-containing protein 2(Homo sapiens (Human))
Burnham Center For Chemical Genomics
Curated by PubChem BioAssay
LigandPNGBDBM54531(2-(2-keto-4-phenyl-chromen-7-yl)oxy-N-(3-pyridyl)a...)
Affinity DataIC50:  1.08E+4nM. Assay description: Data Source: Sanford-Burnham Center for Chemical Genomics (SBCCG) Source Affiliation: Sanford-Burnham Medical Research Institute (SBMRI, San Diego, C...
In DepthDetails PCBioAssay
TargetNucleotide-binding oligomerization domain-containing protein 1(Homo sapiens (Human))
Burnham Center For Chemical Genomics
Curated by PubChem BioAssay
LigandPNGBDBM54531(2-(2-keto-4-phenyl-chromen-7-yl)oxy-N-(3-pyridyl)a...)
Affinity DataEC50:  750nM. Assay description: Data Source: Sanford-Burnham Center for Chemical Genomics (SBCCG) Source Affiliation: Sanford-Burnham Medical Research Institute (SBMRI, San Diego, C...
In DepthDetails PCBioAssay
TargetTumor necrosis factor(Homo sapiens (Human))
Burnham Center For Chemical Genomics
Curated by PubChem BioAssay
LigandPNGBDBM54531(2-(2-keto-4-phenyl-chromen-7-yl)oxy-N-(3-pyridyl)a...)
Affinity DataIC50:  4.59E+3nM. Assay description: Data Source: Sanford-Burnham Center for Chemical Genomics (SBCCG) Source Affiliation: Sanford-Burnham Medical Research Institute (SBMRI, San Diego, C...
In DepthDetails PCBioAssay
TargetNucleotide-binding oligomerization domain-containing protein 1(Homo sapiens (Human))
Burnham Center For Chemical Genomics
Curated by PubChem BioAssay
LigandPNGBDBM54531(2-(2-keto-4-phenyl-chromen-7-yl)oxy-N-(3-pyridyl)a...)
Affinity DataIC50:  3.17E+3nM. Assay description: Data Source: Sanford-Burnham Center for Chemical Genomics (SBCCG) Source Affiliation: Sanford-Burnham Medical Research Institute (SBMRI, San Diego, C...
In DepthDetails PCBioAssay
TargetTumor necrosis factor(Homo sapiens (Human))
Burnham Center For Chemical Genomics
Curated by PubChem BioAssay
LigandPNGBDBM54531(2-(2-keto-4-phenyl-chromen-7-yl)oxy-N-(3-pyridyl)a...)
Affinity DataIC50:  2.22E+3nM. Assay description: Data Source: Sanford-Burnham Center for Chemical Genomics (SBCCG) Source Affiliation: Sanford-Burnham Medical Research Institute (SBMRI, San Diego, C...
In DepthDetails PCBioAssay