BDBM54952 6-cycloheptyl-3-(2-furanyl)-[1,2,4]triazolo[3,4-b][1,3,4]thiadiazole::6-cycloheptyl-3-(2-furyl)-[1,2,4]triazolo[3,4-b][1,3,4]thiadiazole::6-cycloheptyl-3-(furan-2-yl)-[1,2,4]triazolo[3,4-b][1,3,4]thiadiazole::VU0364702-1::cid_44236875
SMILES C1CCCC(CC1)c1nn2c(nnc2s1)-c1ccco1
InChI Key InChIKey=QRPPDWYDNILJJG-UHFFFAOYSA-N
Data  3 EC50
  Tab Delimited (TSV)   2D SDfile   Computed 3D by Vconf -m prep SDfile
Find this compound or compounds like it in BindingDB:
Activity Spreadsheet -- Enzyme Inhibition Constant Data from BindingDB
Found 3 hits for monomerid = 54952
TargetMitogen-activated protein kinase kinase kinase 3(Homo sapiens (Human))
Nmmlsc
Curated by PubChem BioAssay
LigandPNGBDBM54952(6-cycloheptyl-3-(2-furanyl)-[1,2,4]triazolo[3,4-b]...)
Affinity DataEC50: >3.00E+4nM. Assay description: University of New Mexico Assay Overview: Assay Support: 1R03MH084830-01 Project Title: TR-FRET HTS Assay for Inhibitors of MEKK2-MEK5 PB1 Domain...
In DepthDetails PCBioAssay
LigandPNGBDBM54952(6-cycloheptyl-3-(2-furanyl)-[1,2,4]triazolo[3,4-b]...)
Affinity DataEC50: >3.00E+4nM. Assay description: University of New Mexico Assay Overview: Assay Support: 1R03MH084830-01 Project Title: TR-FRET HTS Assay for Inhibitors of MEKK2-MEK5 PB1 Domain...
In DepthDetails PCBioAssay
LigandPNGBDBM54952(6-cycloheptyl-3-(2-furanyl)-[1,2,4]triazolo[3,4-b]...)
Affinity DataEC50: >3.00E+4nM. Assay description: University of New Mexico Assay Overview: Assay Support: 1R03MH084830-01 Project Title: TR-FRET HTS Assay for Inhibitors of MEKK2-MEK5 PB1 Domain...
In DepthDetails PCBioAssay