BDBM5509 2-Amino-6-(2 -tetrahydropyranyl)methoxypurine::6-(oxan-2-ylmethoxy)-9H-purin-2-amine::O6-Substituted Guanine Deriv. 50
SMILES Nc1nc(OCC2CCCCO2)c2[nH]cnc2n1
InChI Key InChIKey=NLIBOJMWCGFEDK-UHFFFAOYSA-N
  Tab Delimited (TSV)   2D SDfile   Computed 3D by Vconf -m prep SDfile
Find this compound or compounds like it in BindingDB:
Activity Spreadsheet -- Enzyme Inhibition Constant Data from BindingDB
Found 2 hits for monomerid = 5509
TargetCyclin-A2 [171-432]/Cyclin-dependent kinase 2(Homo sapiens (Human))
University Of Newcastle
LigandPNGBDBM5509(2-Amino-6-(2 -tetrahydropyranyl)methoxypurine | 6-...)
Affinity Data. Assay description: The enzyme was assayed with substrate histone H1 in the presence of 12.5 uM ATP/[gamma-32P] ATP. IC50 is the inhibitor concentration, which inhibits ...
In DepthDetails ArticlePubMed
TargetCyclin-dependent kinase 1/G2/mitotic-specific cyclin-B(Marthasterias glacialis (starfish))
University Of Newcastle
LigandPNGBDBM5509(2-Amino-6-(2 -tetrahydropyranyl)methoxypurine | 6-...)
Affinity Data. Assay description: The enzyme was assayed with substrate histone H1 in the presence of 12.5 uM ATP/[gamma-32P] ATP. IC50 is the inhibitor concentration, which inhibits ...
In DepthDetails ArticlePubMed