BDBM55203 3-Benzyl-5-(4,5-dihydro-oxazol-2-yl)-3H-[1,2,3]triazol-4-ylamine::3-benzyl-5-(4,5-dihydro-1,3-oxazol-2-yl)triazol-4-amine::5-(4,5-dihydro-1,3-oxazol-2-yl)-3-(phenylmethyl)-1,2,3-triazol-4-amine::5-(4,5-dihydrooxazol-2-yl)-3-(phenylmethyl)-4-triazolamine::MLS000073395::SMR000010818::[3-benzyl-5-(2-oxazolin-2-yl)triazol-4-yl]amine::cid_563388
SMILES Nc1c(nnn1Cc1ccccc1)C1=NCCO1
InChI Key InChIKey=OEABJCWBQDFEHZ-UHFFFAOYSA-N
Data  1 IC50
  Tab Delimited (TSV)   2D SDfile   Computed 3D by Vconf -m prep SDfile
Find this compound or compounds like it in BindingDB:
Activity Spreadsheet -- Enzyme Inhibition Constant Data from BindingDB
Found 1 hit for monomerid = 55203
TargetNeutrophil cytosol factor 1 [S99G](Homo sapiens (Human))
Emory University
Curated by PubChem BioAssay
LigandPNGBDBM55203(3-Benzyl-5-(4,5-dihydro-oxazol-2-yl)-3H-[1,2,3]tri...)
Affinity DataIC50:  5.00E+4nM. Assay description: NIH Molecular Libraries Screening Centers Network [MLSCN] Emory Chemical Biology Discovery Center in MLSCN Assay provider: Susan Smith, Emory Univers...
In DepthDetails PCBioAssay