BDBM55260 2-[[2-keto-2-(2-methylindolin-1-yl)ethyl]thio]-6-methyl-1H-pyrimidin-4-one::6-methyl-2-[2-(2-methyl-2,3-dihydroindol-1-yl)-2-oxidanylidene-ethyl]sulfanyl-1H-pyrimidin-4-one::6-methyl-2-[2-(2-methyl-2,3-dihydroindol-1-yl)-2-oxoethyl]sulfanyl-1H-pyrimidin-4-one::6-methyl-2-[[2-(2-methyl-2,3-dihydroindol-1-yl)-2-oxoethyl]thio]-1H-pyrimidin-4-one::MLS000048904::SMR000061726::cid_2998848
SMILES CC1Cc2ccccc2N1C(=O)CSc1nc(C)cc(=O)[nH]1
InChI Key InChIKey=YZPXRPPSSRPSRT-UHFFFAOYSA-N
Data  1 IC50
  Tab Delimited (TSV)   2D SDfile   Computed 3D by Vconf -m prep SDfile
Find this compound or compounds like it in BindingDB:
Activity Spreadsheet -- Enzyme Inhibition Constant Data from BindingDB
Found 1 hit for monomerid = 55260
TargetNeutrophil cytosol factor 1 [S99G](Homo sapiens (Human))
Emory University
Curated by PubChem BioAssay
LigandPNGBDBM55260(2-[[2-keto-2-(2-methylindolin-1-yl)ethyl]thio]-6-m...)
Affinity DataIC50:  5.00E+4nM. Assay description: NIH Molecular Libraries Screening Centers Network [MLSCN] Emory Chemical Biology Discovery Center in MLSCN Assay provider: Susan Smith, Emory Univers...
In DepthDetails PCBioAssay