BDBM55325 2-[[5-(2,3-dihydro-1,4-benzodioxin-3-yl)-1,3,4-oxadiazol-2-yl]sulfanyl]-N-(1,3-thiazol-2-yl)acetamide::2-[[5-(2,3-dihydro-1,4-benzodioxin-3-yl)-1,3,4-oxadiazol-2-yl]sulfanyl]-N-(1,3-thiazol-2-yl)ethanamide::2-[[5-(2,3-dihydro-1,4-benzodioxin-3-yl)-1,3,4-oxadiazol-2-yl]thio]-N-(2-thiazolyl)acetamide::2-[[5-(2,3-dihydro-1,4-benzodioxin-3-yl)-1,3,4-oxadiazol-2-yl]thio]-N-thiazol-2-yl-acetamide::MLS000116588::SMR000093555::cid_3566321
SMILES O=C(CSc1nnc(o1)C1COc2ccccc2O1)Nc1nccs1
InChI Key InChIKey=QDOIRWRKDGMPJR-UHFFFAOYSA-N
Data  1 IC50
  Tab Delimited (TSV)   2D SDfile   Computed 3D by Vconf -m prep SDfile
Find this compound or compounds like it in BindingDB:
Activity Spreadsheet -- Enzyme Inhibition Constant Data from BindingDB
Found 1 hit for monomerid = 55325
TargetNeutrophil cytosol factor 1 [S99G](Homo sapiens (Human))
Emory University
Curated by PubChem BioAssay
LigandPNGBDBM55325(2-[[5-(2,3-dihydro-1,4-benzodioxin-3-yl)-1,3,4-oxa...)
Affinity DataIC50:  5.00E+4nM. Assay description: NIH Molecular Libraries Screening Centers Network [MLSCN] Emory Chemical Biology Discovery Center in MLSCN Assay provider: Susan Smith, Emory Univers...
In DepthDetails PCBioAssay