BDBM55421 2-[(4-keto-3-phenethyl-benzothiopheno[3,2-d]pyrimidin-2-yl)thio]-N-(5-methyl-1H-pyrazol-3-yl)acetamide::MLS000520707::N-(5-methyl-1H-pyrazol-3-yl)-2-[[4-oxidanylidene-3-(2-phenylethyl)-[1]benzothiolo[3,2-d]pyrimidin-2-yl]sulfanyl]ethanamide::N-(5-methyl-1H-pyrazol-3-yl)-2-[[4-oxo-3-(2-phenylethyl)-[1]benzothiolo[3,2-d]pyrimidin-2-yl]sulfanyl]acetamide::N-(5-methyl-1H-pyrazol-3-yl)-2-[[4-oxo-3-(2-phenylethyl)-[1]benzothiolo[3,2-d]pyrimidin-2-yl]thio]acetamide::SMR000131117::cid_3627482
SMILES Cc1cc(NC(=O)CSc2nc3c4ccccc4sc3c(=O)n2CCc2ccccc2)[nH]n1
InChI Key InChIKey=LJLNHJSVMLXHAP-UHFFFAOYSA-N
Data  1 IC50
  Tab Delimited (TSV)   2D SDfile   Computed 3D by Vconf -m prep SDfile
Find this compound or compounds like it in BindingDB:
Activity Spreadsheet -- Enzyme Inhibition Constant Data from BindingDB
Found 1 hit for monomerid = 55421
TargetNeutrophil cytosol factor 1 [S99G](Homo sapiens (Human))
Emory University
Curated by PubChem BioAssay
LigandPNGBDBM55421(2-[(4-keto-3-phenethyl-benzothiopheno[3,2-d]pyrimi...)
Affinity DataIC50:  5.00E+4nM. Assay description: NIH Molecular Libraries Screening Centers Network [MLSCN] Emory Chemical Biology Discovery Center in MLSCN Assay provider: Susan Smith, Emory Univers...
In DepthDetails PCBioAssay