BDBM55714 3-[(3-carbethoxy-6-carbomethoxy-4-quinolyl)amino]benzoic acid;hydrochloride::3-[(3-ethoxycarbonyl-6-methoxycarbonyl-4-quinolinyl)amino]benzoic acid;hydrochloride::3-[(3-ethoxycarbonyl-6-methoxycarbonyl-quinolin-4-yl)amino]benzoic acid;hydrochloride::3-[(3-ethoxycarbonyl-6-methoxycarbonylquinolin-4-yl)amino]benzoic acid;hydrochloride::MLS000715156::SMR000275135::cid_2790990
SMILES CCOC(=O)c1cnc2ccc(cc2c1Nc1cccc(c1)C(O)=O)C(=O)OC
InChI Key InChIKey=UPJBGXIOQMQQJO-UHFFFAOYSA-N
Data  3 IC50
  Tab Delimited (TSV)   2D SDfile   Computed 3D by Vconf -m prep SDfile
Find this compound or compounds like it in BindingDB:
Activity Spreadsheet -- Enzyme Inhibition Constant Data from BindingDB
Found 3 hits for monomerid = 55714
TargetNeutrophil cytosol factor 1 [S99G](Homo sapiens (Human))
Emory University
Curated by PubChem BioAssay
LigandPNGBDBM55714(3-[(3-carbethoxy-6-carbomethoxy-4-quinolyl)amino]b...)
Affinity DataIC50:  5.00E+4nM. Assay description: NIH Molecular Libraries Screening Centers Network [MLSCN] Emory Chemical Biology Discovery Center in MLSCN Assay provider: Susan Smith, Emory Univers...
In DepthDetails PCBioAssay
TargetBromodomain-containing protein 4(Homo sapiens (Human))
Genentech
Curated by ChEMBL
LigandPNGBDBM55714(3-[(3-carbethoxy-6-carbomethoxy-4-quinolyl)amino]b...)
Affinity DataIC50: >2.00E+4nM. Assay description: Inhibition of His tagged recombinant BRD4 bromodomain 1 (unknown origin) by TR-FRET assay
In DepthDetails ArticlePubMed
TargetCREB-binding protein(Homo sapiens (Human))
Genentech
Curated by ChEMBL
LigandPNGBDBM55714(3-[(3-carbethoxy-6-carbomethoxy-4-quinolyl)amino]b...)
Affinity DataIC50:  230nM. Assay description: Inhibition of His tagged recombinant CBP (unknown origin) by TR-FRET assay
In DepthDetails ArticlePubMed