BDBM55978 2-furancarboxylic acid [2-(cyclohexylamino)-1-(3,4-dimethoxyphenyl)-2-oxoethyl] ester::Furan-2-carboxylic acid cyclohexylcarbamoyl-(3,4-dimethoxy-phenyl)-methyl ester::MLS000073863::SMR000006578::[2-(cyclohexylamino)-1-(3,4-dimethoxyphenyl)-2-oxidanylidene-ethyl] furan-2-carboxylate::[2-(cyclohexylamino)-1-(3,4-dimethoxyphenyl)-2-oxoethyl] furan-2-carboxylate::cid_650571::furan-2-carboxylic acid [2-(cyclohexylamino)-1-(3,4-dimethoxyphenyl)-2-keto-ethyl] ester
SMILES COc1ccc(cc1OC)C(OC(=O)c1ccco1)C(=O)NC1CCCCC1
InChI Key InChIKey=TYJZYWSKAPIXHL-UHFFFAOYSA-N
Data  1 IC50
  Tab Delimited (TSV)   2D SDfile   Computed 3D by Vconf -m prep SDfile
Find this compound or compounds like it in BindingDB:
Activity Spreadsheet -- Enzyme Inhibition Constant Data from BindingDB
Found 1 hit for monomerid = 55978
TargetKallikrein-5(Homo sapiens (Human))
Pcmd
Curated by PubChem BioAssay
LigandPNGBDBM55978(2-furancarboxylic acid [2-(cyclohexylamino)-1-(3,4...)
Affinity DataIC50:  5.00E+4nM. Assay description: Molecular Library Screening Center Network (MLSCN) Penn Center for Molecular Discovery (PCMD) Assay Provider: Scott L. Diamond, University of Pennsy...
In DepthDetails PCBioAssay