BDBM56022 3-[4-allyl-5-(p-anisylthio)-1,2,4-triazol-3-yl]pyridine::3-[5-[(4-methoxyphenyl)methylsulfanyl]-4-prop-2-enyl-1,2,4-triazol-3-yl]pyridine::3-[5-[(4-methoxyphenyl)methylthio]-4-prop-2-enyl-1,2,4-triazol-3-yl]pyridine::MLS000041957::SMR000043646::cid_662969
SMILES COc1ccc(CSc2nnc(-c3cccnc3)n2CC=C)cc1
InChI Key InChIKey=FDFUWGFHUBXIHU-UHFFFAOYSA-N
Data  1 IC50
  Tab Delimited (TSV)   2D SDfile   Computed 3D by Vconf -m prep SDfile
Find this compound or compounds like it in BindingDB:
Activity Spreadsheet -- Enzyme Inhibition Constant Data from BindingDB
Found 1 hit for monomerid = 56022
TargetKallikrein-5(Homo sapiens (Human))
Pcmd
Curated by PubChem BioAssay
LigandPNGBDBM56022(3-[4-allyl-5-(p-anisylthio)-1,2,4-triazol-3-yl]pyr...)
Affinity DataIC50:  5.00E+4nM. Assay description: Molecular Library Screening Center Network (MLSCN) Penn Center for Molecular Discovery (PCMD) Assay Provider: Scott L. Diamond, University of Pennsy...
In DepthDetails PCBioAssay