BDBM5623 3-Isobutyl-5-(acetamido)indeno[1,2-c]pyrazol-4-one::Indenopyrazole 13f::N-[3-(2-methylpropyl)-4-oxo-2H,4H-indeno[1,2-c]pyrazol-5-yl]acetamide
SMILES CC(C)Cc1[nH]nc2-c3cccc(NC(C)=O)c3C(=O)c12
InChI Key InChIKey=QJKZRGVYNZSKPX-UHFFFAOYSA-N
Data  2 IC50
  Tab Delimited (TSV)   2D SDfile   Computed 3D by Vconf -m prep SDfile
Find this compound or compounds like it in BindingDB:
Activity Spreadsheet -- Enzyme Inhibition Constant Data from BindingDB
Found 2 hits for monomerid = 5623
TargetCyclin-dependent kinase 2/G1/S-specific cyclin-E1(Homo sapiens (Human))
Bristol-Myers Squibb
LigandPNGBDBM5623(3-Isobutyl-5-(acetamido)indeno[1,2-c]pyrazol-4-one...)
Affinity DataIC50: >3.50E+3nM. Assay description: The enzyme was assayed with substrate GST-Rb in the presence of 50 uM ATP/[gamma-32P] ATP, and capturing the 32-P labeled reaction products on GSH-Se...
In DepthDetails ArticlePubMed
TargetCyclin-dependent kinase 4/G1/S-specific cyclin-D1(Homo sapiens (Human))
Bristol-Myers Squibb
LigandPNGBDBM5623(3-Isobutyl-5-(acetamido)indeno[1,2-c]pyrazol-4-one...)
Affinity DataIC50: >3.50E+3nM. Assay description: The enzyme was assayed with substrate GST-Rb in the presence of 50 uM ATP/[gamma-32P] ATP, and capturing the 32-P labeled reaction products on GSH-Se...
In DepthDetails ArticlePubMed