BDBM56314 3-(4-Chloro-phenyl)-6-(pyridin-2-ylmethylsulfanyl)-pyridazine::3-(4-chlorophenyl)-6-(2-pyridinylmethylthio)pyridazine::3-(4-chlorophenyl)-6-(2-pyridylmethylthio)pyridazine::3-(4-chlorophenyl)-6-(pyridin-2-ylmethylsulfanyl)pyridazine::MLS000067931::SMR000122433::cid_3227974
SMILES Clc1ccc(cc1)-c1ccc(SCc2ccccn2)nn1
InChI Key InChIKey=ANGJLDWAVZOCAK-UHFFFAOYSA-N
Data  1 IC50
  Tab Delimited (TSV)   2D SDfile   Computed 3D by Vconf -m prep SDfile
Find this compound or compounds like it in BindingDB:
Activity Spreadsheet -- Enzyme Inhibition Constant Data from BindingDB
Found 1 hit for monomerid = 56314
TargetKallikrein-5(Homo sapiens (Human))
Pcmd
Curated by PubChem BioAssay
LigandPNGBDBM56314(3-(4-Chloro-phenyl)-6-(pyridin-2-ylmethylsulfanyl)...)
Affinity DataIC50:  5.00E+4nM. Assay description: Molecular Library Screening Center Network (MLSCN) Penn Center for Molecular Discovery (PCMD) Assay Provider: Scott L. Diamond, University of Pennsy...
In DepthDetails PCBioAssay