BDBM56363 4-[2,5-bis(oxidanylidene)pyrrolidin-1-yl]-N-(4-bromanyl-2-fluoranyl-phenyl)butanamide::MLS000538275::N-(4-bromo-2-fluoro-phenyl)-4-succinimido-butyramide::N-(4-bromo-2-fluorophenyl)-4-(2,5-dioxo-1-pyrrolidinyl)butanamide::N-(4-bromo-2-fluorophenyl)-4-(2,5-dioxopyrrolidin-1-yl)butanamide::SMR000144315::cid_2219836
SMILES Fc1cc(Br)ccc1NC(=O)CCCN1C(=O)CCC1=O
InChI Key InChIKey=YCXMLCOOIJYVDZ-UHFFFAOYSA-N
Data  1 IC50
  Tab Delimited (TSV)   2D SDfile   Computed 3D by Vconf -m prep SDfile
Find this compound or compounds like it in BindingDB:
Activity Spreadsheet -- Enzyme Inhibition Constant Data from BindingDB
Found 1 hit for monomerid = 56363
TargetKallikrein-5(Homo sapiens (Human))
Pcmd
Curated by PubChem BioAssay
LigandPNGBDBM56363(4-[2,5-bis(oxidanylidene)pyrrolidin-1-yl]-N-(4-bro...)
Affinity DataIC50:  5.00E+4nM. Assay description: Molecular Library Screening Center Network (MLSCN) Penn Center for Molecular Discovery (PCMD) Assay Provider: Scott L. Diamond, University of Pennsy...
In DepthDetails PCBioAssay