BDBM5663 2-amino-5-thio-substituted thiazole 30::N-(5-{[(5-tert-butyl-1,3-oxazol-2-yl)methyl]sulfanyl}-1,3-thiazol-2-yl)-2,2-dimethylpropanamide::N-[5-[[[5-tert-Butyl-2-oxazolyl]methyl]thio]-2-thiazolyl]-2,2-tert-butylamide
SMILES CC(C)(C)C(=O)Nc1ncc(SCc2ncc(o2)C(C)(C)C)s1
InChI Key InChIKey=WKTFFSVUCQARKP-UHFFFAOYSA-N
Data  3 IC50
  Tab Delimited (TSV)   2D SDfile   Computed 3D by Vconf -m prep SDfile
Find this compound or compounds like it in BindingDB:
Activity Spreadsheet -- Enzyme Inhibition Constant Data from BindingDB
Found 3 hits for monomerid = 5663
TargetCyclin-dependent kinase/G2/mitotic-specific cyclin- 1(Homo sapiens (Human))
Bristol-Myers Squibb Pharmaceutical Research Institute
LigandPNGBDBM5663(2-amino-5-thio-substituted thiazole 30 | N-(5-{[(5...)
Affinity DataIC50:  90nMpH: 8.0 T: 2°C. Assay description:  The enzyme was assayed with substrate in the presence of 25 uM ATP/[gamma-33P] ATP and test compound. Dose response curves were generated to determ...
In DepthDetails ArticlePubMed
TargetCyclin-dependent kinase 4/G1/S-specific cyclin-D1(Homo sapiens (Human))
Bristol-Myers Squibb Pharmaceutical Research Institute
LigandPNGBDBM5663(2-amino-5-thio-substituted thiazole 30 | N-(5-{[(5...)
Affinity DataIC50:  3.48E+3nM. Assay description:  The enzyme was assayed with substrate in the presence of 25 uM ATP/[gamma-33P] ATP and test compound. Dose response curves were generated to determ...
In DepthDetails ArticlePubMed
TargetCyclin-dependent kinase 2/G1/S-specific cyclin-E1(Homo sapiens (Human))
Bristol-Myers Squibb Pharmaceutical Research Institute
LigandPNGBDBM5663(2-amino-5-thio-substituted thiazole 30 | N-(5-{[(5...)
Affinity DataIC50:  17nM. Assay description:  The enzyme was assayed with substrate in the presence of 25 uM ATP/[gamma-33P] ATP and test compound. Dose response curves were generated to determ...
In DepthDetails ArticlePubMed