BDBM56709 2-(2-norbornyl)-N-[4-(2-pyridyl)thiazol-2-yl]acetamide::2-(3-bicyclo[2.2.1]heptanyl)-N-(4-pyridin-2-yl-1,3-thiazol-2-yl)acetamide::2-(3-bicyclo[2.2.1]heptanyl)-N-(4-pyridin-2-yl-1,3-thiazol-2-yl)ethanamide::2-(3-bicyclo[2.2.1]heptanyl)-N-[4-(2-pyridinyl)-2-thiazolyl]acetamide::MLS000517036::SMR000343160::cid_3923974
SMILES [H]C12CCC([H])(C1)C(CC(=O)Nc1nc(cs1)-c1ccccn1)C2
InChI Key InChIKey=VSWGQYYTVBZMHR-UHFFFAOYSA-N
Data  1 IC50  1 EC50
  Tab Delimited (TSV)   2D SDfile   Computed 3D by Vconf -m prep SDfile
Find this compound or compounds like it in BindingDB:
Activity Spreadsheet -- Enzyme Inhibition Constant Data from BindingDB
Found 2 hits for monomerid = 56709
TargetStreptokinase A(Streptococcus pyogenes M1 GAS)
Broad Institute
Curated by PubChem BioAssay
LigandPNGBDBM56709(2-(2-norbornyl)-N-[4-(2-pyridyl)thiazol-2-yl]aceta...)
Affinity DataEC50:  1.50E+5nM. Assay description: Keywords: Group A streptococcus, GAS, streptokinase, expression, virulence, inhibition, dose response, EC50 Assay Overview: The goal of this assa...
In DepthDetails PCBioAssay
TargetKallikrein-5(Homo sapiens (Human))
Pcmd
Curated by PubChem BioAssay
LigandPNGBDBM56709(2-(2-norbornyl)-N-[4-(2-pyridyl)thiazol-2-yl]aceta...)
Affinity DataIC50:  5.00E+4nM. Assay description: Molecular Library Screening Center Network (MLSCN) Penn Center for Molecular Discovery (PCMD) Assay Provider: Scott L. Diamond, University of Pennsy...
In DepthDetails PCBioAssay