BDBM56958 2-(2-methylphenoxy)-N-(2-piperidin-1-ylphenyl)acetamide::2-(2-methylphenoxy)-N-(2-piperidin-1-ylphenyl)ethanamide::2-(2-methylphenoxy)-N-(2-piperidinophenyl)acetamide::2-(2-methylphenoxy)-N-[2-(1-piperidinyl)phenyl]acetamide::MLS000053530::SMR000064271::cid_2114488
SMILES Cc1ccccc1OCC(=O)Nc1ccccc1N1CCCCC1
InChI Key InChIKey=IXBPTCXEKAISIA-UHFFFAOYSA-N
Data  3 EC50
  Tab Delimited (TSV)   2D SDfile   Computed 3D by Vconf -m prep SDfile
Find this compound or compounds like it in BindingDB:
Activity Spreadsheet -- Enzyme Inhibition Constant Data from BindingDB
Found 3 hits for monomerid = 56958
TargetStreptokinase A(Streptococcus pyogenes M1 GAS)
Broad Institute
Curated by PubChem BioAssay
LigandPNGBDBM56958(2-(2-methylphenoxy)-N-(2-piperidin-1-ylphenyl)acet...)
Affinity DataEC50:  1.42E+4nM. Assay description: Keywords: Group A streptococcus, GAS, streptokinase, expression, virulence, inhibition, dose response, EC50 Assay Overview: The goal of this assa...
In DepthDetails PCBioAssay
TargetProtein RecA(Mycobacterium tuberculosis H37Rv)
Broad Institute
Curated by PubChem BioAssay
LigandPNGBDBM56958(2-(2-methylphenoxy)-N-(2-piperidin-1-ylphenyl)acet...)
Affinity DataEC50:  2.42E+5nM. Assay description: Keywords: GFP-RecA intein, protein splicing, refolding, reducing reagent, GFP fluorescence Assay Overview: M. tuberculosis harbors three inteins, whi...
In DepthDetails PCBioAssay
TargetProtein RecA(Mycobacterium tuberculosis H37Rv)
Broad Institute
Curated by PubChem BioAssay
LigandPNGBDBM56958(2-(2-methylphenoxy)-N-(2-piperidin-1-ylphenyl)acet...)
Affinity DataEC50: >3.80E+5nM. Assay description: Keywords: GFP, refolding, reducing reagent, GFP fluorescence Assay Overview: M. tuberculosis harbors three inteins, which interrupt the DnaB, RecA, a...
In DepthDetails PCBioAssay