BDBM57175 (3-anilino-5-methyl-1-pyrazolyl)-(4-bromophenyl)methanone::(3-anilino-5-methyl-pyrazol-1-yl)-(4-bromophenyl)methanone::(3-anilino-5-methylpyrazol-1-yl)-(4-bromophenyl)methanone::(4-bromophenyl)-(5-methyl-3-phenylazanyl-pyrazol-1-yl)methanone::1-(4-bromobenzoyl)-5-methyl-N-phenyl-1H-pyrazol-3-amine::MLS000533186::SMR000140624::cid_2257388
SMILES Cc1cc(Nc2ccccc2)nn1C(=O)c1ccc(Br)cc1
InChI Key InChIKey=RDZYFEYRRMACOX-UHFFFAOYSA-N
Data  1 EC50
  Tab Delimited (TSV)   2D SDfile   Computed 3D by Vconf -m prep SDfile
Find this compound or compounds like it in BindingDB:
Activity Spreadsheet -- Enzyme Inhibition Constant Data from BindingDB
Found 1 hit for monomerid = 57175
TargetStreptokinase A(Streptococcus pyogenes M1 GAS)
Broad Institute
Curated by PubChem BioAssay
LigandPNGBDBM57175((3-anilino-5-methyl-1-pyrazolyl)-(4-bromophenyl)me...)
Affinity DataEC50:  1.50E+5nM. Assay description: Keywords: Group A streptococcus, GAS, streptokinase, expression, virulence, inhibition, dose response, EC50 Assay Overview: The goal of this assa...
In DepthDetails PCBioAssay