BDBM57189 2-[[2-amino-1-(3-methoxypropyl)pyrrolo[3,2-b]quinoxaline-3-carbonyl]amino]-4,5,6,7-tetrahydrobenzothiophene-3-carboxylic acid ethyl ester::2-[[[2-amino-1-(3-methoxypropyl)-3-pyrrolo[3,2-b]quinoxalinyl]-oxomethyl]amino]-4,5,6,7-tetrahydro-1-benzothiophene-3-carboxylic acid ethyl ester::2-{[2-Amino-1-(3-methoxy-propyl)-1H-pyrrolo[2,3-b]quinoxaline-3-carbonyl]-amino}-4,5,6,7-tetrahydro-b enzo[b]thiophene-3-carboxylic acid ethyl ester::MLS000595320::SMR000149843::cid_1927171::ethyl 2-[[2-amino-1-(3-methoxypropyl)pyrrolo[3,2-b]quinoxaline-3-carbonyl]amino]-4,5,6,7-tetrahydro-1-benzothiophene-3-carboxylate::ethyl 2-[[2-azanyl-1-(3-methoxypropyl)pyrrolo[3,2-b]quinoxalin-3-yl]carbonylamino]-4,5,6,7-tetrahydro-1-benzothiophene-3-carboxylate
SMILES CCOC(=O)c1c(NC(=O)c2c(N)n(CCCOC)c3nc4ccccc4nc23)sc2CCCCc12
InChI Key InChIKey=KNRRWJMZMCKYOX-UHFFFAOYSA-N
Data  1 EC50
  Tab Delimited (TSV)   2D SDfile   Computed 3D by Vconf -m prep SDfile
Find this compound or compounds like it in BindingDB:
Activity Spreadsheet -- Enzyme Inhibition Constant Data from BindingDB
Found 1 hit for monomerid = 57189
TargetStreptokinase A(Streptococcus pyogenes M1 GAS)
Broad Institute
Curated by PubChem BioAssay
LigandPNGBDBM57189(2-[[2-amino-1-(3-methoxypropyl)pyrrolo[3,2-b]quino...)
Affinity DataEC50:  1.50E+5nM. Assay description: Keywords: Group A streptococcus, GAS, streptokinase, expression, virulence, inhibition, dose response, EC50 Assay Overview: The goal of this assa...
In DepthDetails PCBioAssay