BDBM58040 1-(4-Bromo-phenyl)-4,4,4-trifluoro-2-[(3-nitro-phenyl)-hydrazono]-butane-1,3-dione::1-(4-bromophenyl)-4,4,4-trifluoro-2-[(3-nitrophenyl)hydrazinylidene]butane-1,3-dione::1-(4-bromophenyl)-4,4,4-trifluoro-2-[(3-nitrophenyl)hydrazono]butane-1,3-dione::1-(4-bromophenyl)-4,4,4-tris(fluoranyl)-2-[(3-nitrophenyl)hydrazinylidene]butane-1,3-dione::MLS001029524::SMR000424974::cid_1909215
SMILES [O-][N+](=O)c1cccc(NN=C(C(=O)c2ccc(Br)cc2)C(=O)C(F)(F)F)c1
InChI Key InChIKey=UWSJONFPLPIHFT-UHFFFAOYSA-N
Data  3 EC50
  Tab Delimited (TSV)   2D SDfile   Computed 3D by Vconf -m prep SDfile
Find this compound or compounds like it in BindingDB:
Activity Spreadsheet -- Enzyme Inhibition Constant Data from BindingDB
Found 3 hits for monomerid = 58040
TargetStreptokinase A(Streptococcus pyogenes M1 GAS)
Broad Institute
Curated by PubChem BioAssay
LigandPNGBDBM58040(1-(4-Bromo-phenyl)-4,4,4-trifluoro-2-[(3-nitro-phe...)
Affinity DataEC50:  6.23E+3nM. Assay description: Keywords: Group A streptococcus, GAS, streptokinase, expression, virulence, inhibition, dose response, EC50 Assay Overview: The goal of this assa...
In DepthDetails PCBioAssay
TargetNeuropeptide Y receptor type 1(Homo sapiens (Human))
The Scripps Research Institute Molecular Screening Center
Curated by PubChem BioAssay
LigandPNGBDBM58040(1-(4-Bromo-phenyl)-4,4,4-trifluoro-2-[(3-nitro-phe...)
Affinity DataEC50:  1.06E+4nM. Assay description: Source (MLPCN Center Name): The Scripps Research Institute Molecular Screening Center (SRIMSC) Center Affiliation: The Scripps Research Institute (TS...
In DepthDetails PCBioAssay
TargetNeuropeptide Y receptor type 2(Homo sapiens (Human))
The Scripps Research Institute Molecular Screening Center
Curated by PubChem BioAssay
LigandPNGBDBM58040(1-(4-Bromo-phenyl)-4,4,4-trifluoro-2-[(3-nitro-phe...)
Affinity DataEC50:  1.21E+4nM. Assay description: Source (MLPCN Center Name): The Scripps Research Institute Molecular Screening Center (SRIMSC) Center Affiliation: The Scripps Research Institute (TS...
In DepthDetails PCBioAssay