BDBM58173 (2S)-2-(4-methoxyphenyl)-3-[(2S,3S)-2-(4-methoxyphenyl)-5,7-bis(oxidanyl)-4-oxidanylidene-2,3-dihydrochromen-3-yl]-5,7-bis(oxidanyl)-2,3-dihydrochromen-4-one::(2S)-3-[(2S,3S)-5,7-dihydroxy-2-(4-methoxyphenyl)-4-oxo-2,3-dihydrochromen-3-yl]-5,7-dihydroxy-2-(4-methoxyphenyl)-2,3-dihydrochromen-4-one::(2S)-3-[(2S,3S)-5,7-dihydroxy-2-(4-methoxyphenyl)-4-oxo-3,4-dihydro-2H-1-benzopyran-3-yl]-5,7-dihydroxy-2-(4-methoxyphenyl)-3,4-dihydro-2H-1-benzopyran-4-one::(2S)-3-[(2S,3S)-5,7-dihydroxy-4-keto-2-(4-methoxyphenyl)chroman-3-yl]-5,7-dihydroxy-2-(4-methoxyphenyl)chroman-4-one::Chamaejasmenin B::MLS000728503::SMR000445710::cid_16745525
SMILES COc1ccc(cc1)[C@H]1Oc2cc(O)cc(O)c2C(=O)C1[C@H]1[C@H](Oc2cc(O)cc(O)c2C1=O)c1ccc(OC)cc1
InChI Key InChIKey=BTCICADMSGBCKA-VGVWILAUSA-N
Data  3 IC50  1 EC50
  Tab Delimited (TSV)   2D SDfile   Computed 3D by Vconf -m prep SDfile
Find this compound or compounds like it in BindingDB:
Activity Spreadsheet -- Enzyme Inhibition Constant Data from BindingDB
Found 4 hits for monomerid = 58173
TargetStreptokinase A(Streptococcus pyogenes M1 GAS)
Broad Institute
Curated by PubChem BioAssay
LigandPNGBDBM58173((2S)-2-(4-methoxyphenyl)-3-[(2S,3S)-2-(4-methoxyph...)
Affinity DataEC50:  1.71E+3nM. Assay description: Keywords: Group A streptococcus, GAS, streptokinase, expression, virulence, inhibition, dose response, EC50 Assay Overview: The goal of this assa...
In DepthDetails PCBioAssay
TargetX-box-binding protein 1(Homo sapiens (Human))
Emory University
Curated by PubChem BioAssay
LigandPNGBDBM58173((2S)-2-(4-methoxyphenyl)-3-[(2S,3S)-2-(4-methoxyph...)
Affinity DataIC50:  1.00E+4nM. Assay description: NIH Molecular Libraries Screening Centers Network [MLSCN] Emory Chemical Biology Discovery Center in MLSCN Assay provider: Dr. Randal Kaufman, Univer...
In DepthDetails PCBioAssay
TargetDNA damage-inducible transcript 3 protein(Mus musculus)
Emory University
Curated by PubChem BioAssay
LigandPNGBDBM58173((2S)-2-(4-methoxyphenyl)-3-[(2S,3S)-2-(4-methoxyph...)
Affinity DataIC50: >1.00E+4nM. Assay description: NIH Molecular Libraries Screening Centers Network [MLSCN] Emory Chemical Biology Discovery Center in MLSCN Assay provider: Dr. Randal Kaufman, Univer...
In DepthDetails PCBioAssay
TargetDNA damage-inducible transcript 3 protein(Mus musculus)
Emory University
Curated by PubChem BioAssay
LigandPNGBDBM58173((2S)-2-(4-methoxyphenyl)-3-[(2S,3S)-2-(4-methoxyph...)
Affinity DataIC50: >1.00E+4nM. Assay description: NIH Molecular Libraries Screening Centers Network [MLSCN] Emory Chemical Biology Discovery Center in MLSCN Assay provider: Dr. Randal Kaufman, Univer...
In DepthDetails PCBioAssay