BDBM5887 1-methyl-1-(3-methylphenyl)-3-[4-(1-oxo-2,3-dihydro-1H-isoindol-4-yl)phenyl]urea::CHEMBL184918::isoindolinone analog 18
SMILES CN(C(=O)Nc1ccc(cc1)-c1cccc2C(=O)NCc12)c1cccc(C)c1
InChI Key InChIKey=YGUQDYVWPNWASR-UHFFFAOYSA-N
Data  1 IC50
  Tab Delimited (TSV)   2D SDfile   Computed 3D by Vconf -m prep SDfile
Find this compound or compounds like it in BindingDB:
Activity Spreadsheet -- Enzyme Inhibition Constant Data from BindingDB
Found 1 hit for monomerid = 5887
TargetVascular endothelial growth factor receptor 2(Homo sapiens (Human))
Abbott Laboratories
LigandPNGBDBM5887(1-methyl-1-(3-methylphenyl)-3-[4-(1-oxo-2,3-dihydr...)
Affinity DataIC50:  1.90E+4nMpH: 7.4 T: 2°C. Assay description: The assay was using baculovirus-expressed recombinant protein kinase and biotinylated poly-Glu-Ala-Tyr substrate. HTRF is based on the proximity of a...
In DepthDetails ArticlePubMed