BDBM5893 3-[4-(1-oxo-2,3-dihydro-1H-isoindol-4-yl)phenyl]-1-[3-(trifluoromethyl)phenyl]urea::CHEMBL410711::isoindolinone analog 4e
SMILES FC(F)(F)c1cccc(NC(=O)Nc2ccc(cc2)-c2cccc3C(=O)NCc23)c1
InChI Key InChIKey=HVLQSTLIXZZWIR-UHFFFAOYSA-N
Data  2 IC50
  Tab Delimited (TSV)   2D SDfile   Computed 3D by Vconf -m prep SDfile
Find this compound or compounds like it in BindingDB:
Activity Spreadsheet -- Enzyme Inhibition Constant Data from BindingDB
Found 2 hits for monomerid = 5893
TargetVascular endothelial growth factor receptor 2(Homo sapiens (Human))
Abbott Laboratories
Curated by ChEMBL
LigandPNGBDBM5893(3-[4-(1-oxo-2,3-dihydro-1H-isoindol-4-yl)phenyl]-1...)
Affinity DataIC50:  7nM. Assay description: Inhibition of KDR in presence of 1 mM ATP
In DepthDetails ArticlePubMed
TargetVascular endothelial growth factor receptor 2(Homo sapiens (Human))
Abbott Laboratories
Curated by ChEMBL
LigandPNGBDBM5893(3-[4-(1-oxo-2,3-dihydro-1H-isoindol-4-yl)phenyl]-1...)
Affinity DataIC50:  7nMpH: 7.4 T: 2°C. Assay description: The assay was using baculovirus-expressed recombinant protein kinase and biotinylated poly-Glu-Ala-Tyr substrate. HTRF is based on the proximity of a...
In DepthDetails ArticlePubMed