BDBM5896 1-(3-ethylphenyl)-3-[4-(1-oxo-2,3-dihydro-1H-isoindol-4-yl)phenyl]urea::CHEMBL427321::isoindolinone analog 4h
SMILES CCc1cccc(NC(=O)Nc2ccc(cc2)-c2cccc3C(=O)NCc23)c1
InChI Key InChIKey=WHVFDPUFUPEECO-UHFFFAOYSA-N
Data  1 IC50
  Tab Delimited (TSV)   2D SDfile   Computed 3D by Vconf -m prep SDfile
Find this compound or compounds like it in BindingDB:
Activity Spreadsheet -- Enzyme Inhibition Constant Data from BindingDB
Found 1 hit for monomerid = 5896
TargetVascular endothelial growth factor receptor 2(Homo sapiens (Human))
Abbott Laboratories
LigandPNGBDBM5896(1-(3-ethylphenyl)-3-[4-(1-oxo-2,3-dihydro-1H-isoin...)
Affinity DataIC50:  29nMpH: 7.4 T: 2°C. Assay description: The assay was using baculovirus-expressed recombinant protein kinase and biotinylated poly-Glu-Ala-Tyr substrate. HTRF is based on the proximity of a...
In DepthDetails ArticlePubMed