BDBM59008 1-[[1-(4-methoxyphenyl)-3-pyrrolidinyl]methyl]-3-(2,4,6-trimethylphenyl)thiourea::1-[[1-(4-methoxyphenyl)pyrrolidin-3-yl]methyl]-3-(2,4,6-trimethylphenyl)thiourea::1-mesityl-3-[[1-(4-methoxyphenyl)pyrrolidin-3-yl]methyl]thiourea::MLS000683537::N-mesityl-N'-{[1-(4-methoxyphenyl)pyrrolidin-3-yl]methyl}thiourea::SMR000311694::cid_3687665
SMILES COc1ccc(cc1)N1CCC(CNC(=S)Nc2c(C)cc(C)cc2C)C1
InChI Key InChIKey=FXHGJVWNQLIDGU-UHFFFAOYSA-N
Data  1 EC50
  Tab Delimited (TSV)   2D SDfile   Computed 3D by Vconf -m prep SDfile
Find this compound or compounds like it in BindingDB:
Activity Spreadsheet -- Enzyme Inhibition Constant Data from BindingDB
Found 1 hit for monomerid = 59008
TargetLarge T antigen(Simian virus 40)
Southern Research Specialized Biocontainment Screening Center
Curated by PubChem BioAssay
LigandPNGBDBM59008(1-[[1-(4-methoxyphenyl)-3-pyrrolidinyl]methyl]-3-(...)
Affinity DataEC50:  1.59E+4nM. Assay description: Southern Research's Specialized Biocontainment Screening Center (SRSBSC) Southern Research Institute (Birmingham, Alabama) NIH Molecular Librarie...
In DepthDetails PCBioAssay