BDBM59082 2-[2,5-diketo-4-methyl-4-(p-tolyl)imidazolidin-1-yl]-N-[4-(2-pyridyl)thiazol-2-yl]acetamide::2-[4-methyl-4-(4-methylphenyl)-2,5-bis(oxidanylidene)imidazolidin-1-yl]-N-(4-pyridin-2-yl-1,3-thiazol-2-yl)ethanamide::2-[4-methyl-4-(4-methylphenyl)-2,5-dioxo-1-imidazolidinyl]-N-[4-(2-pyridinyl)-2-thiazolyl]acetamide::2-[4-methyl-4-(4-methylphenyl)-2,5-dioxoimidazolidin-1-yl]-N-(4-pyridin-2-yl-1,3-thiazol-2-yl)acetamide::MLS001159763::SMR000716052::cid_24982028
SMILES Cc1ccc(cc1)C1(C)NC(=O)N(CC(=O)Nc2nc(cs2)-c2ccccn2)C1=O
InChI Key InChIKey=AVFZPVYJKLTCTP-UHFFFAOYSA-N
Data  1 IC50  1 EC50
  Tab Delimited (TSV)   2D SDfile   Computed 3D by Vconf -m prep SDfile
Find this compound or compounds like it in BindingDB:
Activity Spreadsheet -- Enzyme Inhibition Constant Data from BindingDB
Found 2 hits for monomerid = 59082
TargetDNA dC->dU-editing enzyme APOBEC-3G(Homo sapiens (Human))
Burnham Center For Chemical Genomics
Curated by PubChem BioAssay
LigandPNGBDBM59082(2-[2,5-diketo-4-methyl-4-(p-tolyl)imidazolidin-1-y...)
Affinity DataIC50:  2.56E+4nMT: 2°C. Assay description: Data Source: Sanford-Burnham Center for Chemical Genomics (SBCCG) Source Affiliation: Sanford-Burnham Medical Research Institute (SBMRI, San Diego, C...
In DepthDetails PCBioAssay
TargetLarge T antigen(Simian virus 40)
Southern Research Specialized Biocontainment Screening Center
Curated by PubChem BioAssay
LigandPNGBDBM59082(2-[2,5-diketo-4-methyl-4-(p-tolyl)imidazolidin-1-y...)
Affinity DataEC50:  1.13E+4nM. Assay description: Southern Research's Specialized Biocontainment Screening Center (SRSBSC) Southern Research Institute (Birmingham, Alabama) NIH Molecular Librarie...
In DepthDetails PCBioAssay