BDBM5927 BMS-387032 analog 17::N-(5-{[(5-tert-butyl-1,3-oxazol-2-yl)methyl]sulfanyl}-1,3-thiazol-2-yl)cyclohexanecarboxamide::N-[5-[[[5-(1,1-Dimethylethyl)-2-oxazolyl]methyl]thio]-2-thiazolyl]cyclohexanecarboxamide
SMILES CC(C)(C)c1cnc(CSc2cnc(NC(=O)C3CCCCC3)s2)o1
InChI Key InChIKey=IYLMWEFXWOERFM-UHFFFAOYSA-N
Data  1 IC50
  Tab Delimited (TSV)   2D SDfile   Computed 3D by Vconf -m prep SDfile
Find this compound or compounds like it in BindingDB:
Activity Spreadsheet -- Enzyme Inhibition Constant Data from BindingDB
Found 1 hit for monomerid = 5927
TargetCyclin-dependent kinase 2/G1/S-specific cyclin-E1(Homo sapiens (Human))
Bristol-Myers Squibb
LigandPNGBDBM5927(BMS-387032 analog 17 | N-(5-{[(5-tert-butyl-1,3-ox...)
Affinity DataIC50:  300nMpH: 8.0 T: 2°C. Assay description:  The enzyme was assayed with substrate in the presence of 25 uM ATP/[gamma-33P] ATP and test compound. Dose response curves were generated to determ...
In DepthDetails ArticlePubMed