BDBM594 (2R,4S)-N-(2-{[(2R,4S)-5,5-dimethyl-2-[(R)-(1-phenylacetamido)[(2,2,2-trifluoroethyl)carbamoyl]methyl]-1,3-thiazolidin-4-yl]formamido}ethyl)-5,5-dimethyl-2-[(R)-(1-phenylacetamido)[(2,2,2-trifluoroethyl)carbamoyl]methyl]-1,3-thiazolidine-4-carboxamide::Penicillin Et(NH)2 Sym dimer ::penicillin deriv. 7
SMILES [H][C@]1(N[C@@H](C(=O)NCCNC(=O)[C@@H]2N[C@]([H])(SC2(C)C)[C@H](NC(=O)Cc2ccccc2)C(=O)NCC(F)(F)F)C(C)(C)S1)[C@H](NC(=O)Cc1ccccc1)C(=O)NCC(F)(F)F
InChI Key InChIKey=SRJPSKNGOVFEQC-FXDWKFNTSA-N
Data  1 IC50
  Tab Delimited (TSV)   2D SDfile   Computed 3D by Vconf -m prep SDfile
Find this compound or compounds like it in BindingDB:
Activity Spreadsheet -- Enzyme Inhibition Constant Data from BindingDB
Found 1 hit for monomerid = 594
TargetDimer of Gag-Pol polyprotein [489-587](Human immunodeficiency virus type 1)
Glaxo Group Research
LigandPNGBDBM594((2R,4S)-N-(2-{[(2R,4S)-5,5-dimethyl-2-[(R)-(1-phen...)
Affinity DataIC50:  4.40nMpH: 6.0 T: 2°C. Assay description: IC50 values were obtained by assaying the enzyme against the synthetic substrate peptide KQGTVSFNFPQIT, which was tritiated at the proline residue, a...
In DepthDetails ArticlePubMed