BDBM59606 1-(4-methylphenyl)-2-(1H-1,2,4-triazol-5-ylsulfanyl)ethanone::1-(4-methylphenyl)-2-(1H-1,2,4-triazol-5-ylthio)ethanone::1-(p-tolyl)-2-(1H-1,2,4-triazol-5-ylthio)ethanone::1-p-Tolyl-2-(4H-[1,2,4]triazol-3-ylsulfanyl)-ethanone::MLS000068988::SMR000010235::cid_576797
SMILES Cc1ccc(cc1)C(=O)CSc1nnc[nH]1
InChI Key InChIKey=MUVSMNVNXKMPGC-UHFFFAOYSA-N
Data  1 IC50
  Tab Delimited (TSV)   2D SDfile   Computed 3D by Vconf -m prep SDfile
Find this compound or compounds like it in BindingDB:
Activity Spreadsheet -- Enzyme Inhibition Constant Data from BindingDB
Found 1 hit for monomerid = 59606
TargetM17 leucyl aminopeptidase(Plasmodium falciparum 3D7)
Srmlsc
Curated by PubChem BioAssay
LigandPNGBDBM59606(1-(4-methylphenyl)-2-(1H-1,2,4-triazol-5-ylsulfany...)
Affinity DataIC50:  5.05E+4nM. Assay description: Southern Research Molecular Libraries Screening Center (SRMLSC) Southern Research Institute (Birmingham, Alabama) NIH Molecular Libraries Screening...
In DepthDetails PCBioAssay