BDBM59941 2-(3-keto-5-methyl-3-pyrazolin-4-yl)-N-[1-(2-naphthyl)ethylideneamino]acetamide::2-(3-methyl-5-oxidanylidene-1,2-dihydropyrazol-4-yl)-N-(1-naphthalen-2-ylethylideneamino)ethanamide::2-(3-methyl-5-oxo-1,2-dihydropyrazol-4-yl)-N-(1-naphthalen-2-ylethylideneamino)acetamide::2-(3-methyl-5-oxo-1,2-dihydropyrazol-4-yl)-N-[1-(2-naphthalenyl)ethylideneamino]acetamide::2-(5-methyl-3-oxo-2,3-dihydro-1H-pyrazol-4-yl)-N'-[(1E)-1-(2-naphthyl)ethylidene]acetohydrazide::MLS000585494::SMR000207475::cid_687764
SMILES CC(=NNC(=O)Cc1c(C)[nH][nH]c1=O)c1ccc2ccccc2c1
InChI Key InChIKey=FRTQJQBGMVOXDM-UHFFFAOYSA-N
Data  1 IC50
  Tab Delimited (TSV)   2D SDfile   Computed 3D by Vconf -m prep SDfile
Find this compound or compounds like it in BindingDB:
Activity Spreadsheet -- Enzyme Inhibition Constant Data from BindingDB
Found 1 hit for monomerid = 59941
TargetM17 leucyl aminopeptidase(Plasmodium falciparum 3D7)
Srmlsc
Curated by PubChem BioAssay
LigandPNGBDBM59941(2-(3-keto-5-methyl-3-pyrazolin-4-yl)-N-[1-(2-napht...)
Affinity DataIC50:  1.40E+4nM. Assay description: Southern Research Molecular Libraries Screening Center (SRMLSC) Southern Research Institute (Birmingham, Alabama) NIH Molecular Libraries Screening...
In DepthDetails PCBioAssay