BDBM60094 2-[3-[5-chloranyl-4-[(2-chloranyl-4-fluoranyl-phenyl)methylamino]-6-oxidanylidene-pyridazin-1-yl]-1-adamantyl]ethanoic acid::2-[3-[5-chloro-4-[(2-chloro-4-fluoro-benzyl)amino]-6-keto-pyridazin-1-yl]-1-adamantyl]acetic acid::2-[3-[5-chloro-4-[(2-chloro-4-fluorophenyl)methylamino]-6-oxo-1-pyridazinyl]-1-adamantyl]acetic acid::2-[3-[5-chloro-4-[(2-chloro-4-fluorophenyl)methylamino]-6-oxopyridazin-1-yl]-1-adamantyl]acetic acid::MLS000673096::SMR000314337::cid_16189389::{3-[5-chloro-4-[(2-chloro-4-fluorobenzyl)amino]-6-oxopyridazin-1(6H)-yl]-1-adamantyl}acetic acid
SMILES [H]C12CC3([H])CC(CC(O)=O)(C1)CC(C2)(C3)n1ncc(NCc2ccc(F)cc2Cl)c(Cl)c1=O
InChI Key InChIKey=NINIJFNJRWWWII-UHFFFAOYSA-N
Data  2 IC50
  Tab Delimited (TSV)   2D SDfile   Computed 3D by Vconf -m prep SDfile
Find this compound or compounds like it in BindingDB:
Activity Spreadsheet -- Enzyme Inhibition Constant Data from BindingDB
Found 2 hits for monomerid = 60094
TargetInsulin-degrading enzyme(Homo sapiens (Human))
The Scripps Research Institute Molecular Screening Center
Curated by PubChem BioAssay
LigandPNGBDBM60094(2-[3-[5-chloranyl-4-[(2-chloranyl-4-fluoranyl-phen...)
Affinity DataIC50:  1.81E+4nM. Assay description: Source (MLPCN Center Name): The Scripps Research Institute Molecular Screening Center (SRIMSC) Center Affiliation: The Scripps Research Institute (TS...
In DepthDetails PCBioAssay
TargetM17 leucyl aminopeptidase(Plasmodium falciparum 3D7)
Srmlsc
Curated by PubChem BioAssay
LigandPNGBDBM60094(2-[3-[5-chloranyl-4-[(2-chloranyl-4-fluoranyl-phen...)
Affinity DataIC50:  3.21E+4nM. Assay description: Southern Research Molecular Libraries Screening Center (SRMLSC) Southern Research Institute (Birmingham, Alabama) NIH Molecular Libraries Screening...
In DepthDetails PCBioAssay