BDBM60139 1-(4-ethoxyphenyl)-3-[(5-phenyl-1H-1,2,4-triazol-3-yl)sulfanyl]pyrrolidine-2,5-dione::1-(4-ethoxyphenyl)-3-[(5-phenyl-1H-1,2,4-triazol-3-yl)thio]pyrrolidine-2,5-dione::3-[(5-phenyl-1H-1,2,4-triazol-3-yl)thio]-1-p-phenetyl-pyrrolidine-2,5-quinone::MLS000765380::SMR000289485::cid_2931653
SMILES CCOc1ccc(cc1)-n1c(O)cc(Sc2nnc([nH]2)-c2ccccc2)c1O
InChI Key InChIKey=JEDBMLFDZAAJIJ-UHFFFAOYSA-N
Data  3 IC50
  Tab Delimited (TSV)   2D SDfile   Computed 3D by Vconf -m prep SDfile
Find this compound or compounds like it in BindingDB:
Activity Spreadsheet -- Enzyme Inhibition Constant Data from BindingDB
Found 3 hits for monomerid = 60139
TargetM17 leucyl aminopeptidase(Plasmodium falciparum 3D7)
Srmlsc
Curated by PubChem BioAssay
LigandPNGBDBM60139(1-(4-ethoxyphenyl)-3-[(5-phenyl-1H-1,2,4-triazol-3...)
Affinity DataIC50:  1.11E+4nM. Assay description: Southern Research Molecular Libraries Screening Center (SRMLSC) Southern Research Institute (Birmingham, Alabama) NIH Molecular Libraries Screening...
In DepthDetails PCBioAssay
TargetDNA dC->dU-editing enzyme APOBEC-3A(Homo sapiens (Human))
Burnham Center For Chemical Genomics
Curated by PubChem BioAssay
LigandPNGBDBM60139(1-(4-ethoxyphenyl)-3-[(5-phenyl-1H-1,2,4-triazol-3...)
Affinity DataIC50: >1.00E+5nMT: 2°C. Assay description: Data Source: Sanford-Burnham Center for Chemical Genomics (SBCCG) Source Affiliation: Sanford-Burnham Medical Research Institute (SBMRI, San Diego, C...
In DepthDetails PCBioAssay
TargetDNA dC->dU-editing enzyme APOBEC-3G(Homo sapiens (Human))
Burnham Center For Chemical Genomics
Curated by PubChem BioAssay
LigandPNGBDBM60139(1-(4-ethoxyphenyl)-3-[(5-phenyl-1H-1,2,4-triazol-3...)
Affinity DataIC50:  1.40E+4nMT: 2°C. Assay description: Data Source: Sanford-Burnham Center for Chemical Genomics (SBCCG) Source Affiliation: Sanford-Burnham Medical Research Institute (SBMRI, San Diego, C...
In DepthDetails PCBioAssay