BDBM60423 US9062048, 118
SMILES CC(C)C1CC[C@@H](CC1)N1CC(C1)NC(=O)CNc1ncnc2ccc(cc12)C(C)(F)F
InChI Key InChIKey=DDGRFRKRHPEXOC-GOENTQTQSA-N
Data  1 IC50
  Tab Delimited (TSV)   2D SDfile   Computed 3D by Vconf -m prep SDfile
Find this compound or compounds like it in BindingDB:
Activity Spreadsheet -- Enzyme Inhibition Constant Data from BindingDB
Found 1 hit for monomerid = 60423
TargetC-C chemokine receptor-like 2(Homo sapiens (Human))
Janssen Pharmaceutica
US Patent
LigandPNGBDBM60423(US9062048, 118)
Affinity DataIC50:  85nM. Assay description: Human monocytic cell line THP-1 cells were obtained from American Type Culture Collection (Manassas, Va., USA). The THP-1 cells were grown in RPMI-16...
In DepthDetails US Patent