BDBM60432 BDBM50468001::US11236089, Compound AZD-6738::US8552004, 2.02
SMILES C[C@@H]1COCCN1c1cc(nc(n1)-c1ccnc2[nH]ccc12)C1(CC1)[S@](C)(=N)=O
InChI Key InChIKey=OHUHVTCQTUDPIJ-YBKRRLQSSA-N
Data  17 IC50
  Tab Delimited (TSV)   2D SDfile   Computed 3D by Vconf -m prep SDfile
Find this compound or compounds like it in BindingDB:
Activity Spreadsheet -- Enzyme Inhibition Constant Data from BindingDB
Found 17 hits for monomerid = 60432
TargetSerine/threonine-protein kinase ATR(Homo sapiens (Human))
Astrazeneca
US Patent
LigandPNGBDBM60432(BDBM50468001 | US11236089, Compound AZD-6738 | US8...)
Affinity DataIC50:  3.75nMpH: 7.4 T: 2°C. Assay description: ATR for use in the in vitro enzyme assay was obtained from HeLa nuclear extract (CIL Biotech, Mons, Belgium) by immunoprecipitation with rabbit polyc...
In DepthDetails US Patent
TargetSerine/threonine-protein kinase ATR(Rabbit)
Bluevalley Pharmaceutical
US Patent
LigandPNGBDBM60432(BDBM50468001 | US11236089, Compound AZD-6738 | US8...)
Affinity DataIC50: <3nM. Assay description: ATR for use in the in vitro enzyme assay was obtained from HeLa nuclear extract (CIL Biotech, Mons, Belgium) by immunoprecipitation with rabbit polyc...
In DepthDetails US Patent
TargetSerine/threonine-protein kinase mTOR(Homo sapiens (Human))
Astrazeneca
Curated by ChEMBL
LigandPNGBDBM60432(BDBM50468001 | US11236089, Compound AZD-6738 | US8...)
Affinity DataIC50: >2.30E+4nM. Assay description: Inhibition of mTOR in human MDA-MB-468 cells assessed as decrease in AKT phosphorylation at S473 residue
In DepthDetails ArticlePubMed
TargetPotassium voltage-gated channel subfamily H member 2(Homo sapiens (Human))
Astrazeneca
Curated by ChEMBL
LigandPNGBDBM60432(BDBM50468001 | US11236089, Compound AZD-6738 | US8...)
Affinity DataIC50:  1.66E+5nM. Assay description: Inhibition of human ERG by whole cell electrophysiology analysis
In DepthDetails ArticlePubMed
TargetCytochrome P450 2D6(Homo sapiens (Human))
Astrazeneca
Curated by ChEMBL
LigandPNGBDBM60432(BDBM50468001 | US11236089, Compound AZD-6738 | US8...)
Affinity DataIC50: >1.00E+4nM. Assay description: Inhibition of CYP2D6 in human liver microsomes using midazolam as substrate preincubated for 15 mins followed by substrate addition and measured afte...
In DepthDetails ArticlePubMed
TargetCytochrome P450 3A4(Homo sapiens (Human))
Astrazeneca
Curated by ChEMBL
LigandPNGBDBM60432(BDBM50468001 | US11236089, Compound AZD-6738 | US8...)
Affinity DataIC50: >1.00E+4nM. Assay description: Inhibition of CYP3A4 in human liver microsomes using midazolam as substrate preincubated for 15 mins followed by substrate addition and measured afte...
In DepthDetails ArticlePubMed
TargetSerine/threonine-protein kinase ATR(Homo sapiens (Human))
Astrazeneca
US Patent
LigandPNGBDBM60432(BDBM50468001 | US11236089, Compound AZD-6738 | US8...)
Affinity DataIC50:  74nM. Assay description: Inhibition of ATR in human HT29 cells after 60 mins by Hoechst 33258 staining-based assay
In DepthDetails ArticlePubMed
TargetSerine/threonine-protein kinase ATR(Homo sapiens (Human))
Astrazeneca
US Patent
LigandPNGBDBM60432(BDBM50468001 | US11236089, Compound AZD-6738 | US8...)
Affinity DataIC50:  4nM. Assay description: Inhibition of ATR in human HeLa cell nuclear extract using GST-fused p53N66 as substrate preincubated for 10 mins followed by ATP addition and measur...
In DepthDetails ArticlePubMed
TargetSerine/threonine-protein kinase mTOR(Homo sapiens (Human))
Astrazeneca
Curated by ChEMBL
LigandPNGBDBM60432(BDBM50468001 | US11236089, Compound AZD-6738 | US8...)
Affinity DataIC50:  5.70E+3nM. Assay description: Inhibition of mTOR in human MDA-MB-468 cells assessed as decrease in 70S6K S235/236 phosphorylation
In DepthDetails ArticlePubMed
LigandPNGBDBM60432(BDBM50468001 | US11236089, Compound AZD-6738 | US8...)
Affinity DataIC50: >3.00E+4nM. Assay description: Inhibition of PI3Kalpha in human BT-474 cells assessed as decrease in AKT phosphorylation at T308 residue
In DepthDetails ArticlePubMed
TargetCytochrome P450 1A2(Homo sapiens (Human))
Astrazeneca
Curated by ChEMBL
LigandPNGBDBM60432(BDBM50468001 | US11236089, Compound AZD-6738 | US8...)
Affinity DataIC50: >1.00E+4nM. Assay description: Inhibition of CYP1A2 in human liver microsomes using midazolam as substrate preincubated for 15 mins followed by substrate addition and measured afte...
In DepthDetails ArticlePubMed
TargetCytochrome P450 2C19(Homo sapiens (Human))
Astrazeneca
Curated by ChEMBL
LigandPNGBDBM60432(BDBM50468001 | US11236089, Compound AZD-6738 | US8...)
Affinity DataIC50: >1.00E+4nM. Assay description: Inhibition of CYP2C19 in human liver microsomes using midazolam as substrate preincubated for 15 mins followed by substrate addition and measured aft...
In DepthDetails ArticlePubMed
TargetCytochrome P450 2C9(Homo sapiens (Human))
Astrazeneca
Curated by ChEMBL
LigandPNGBDBM60432(BDBM50468001 | US11236089, Compound AZD-6738 | US8...)
Affinity DataIC50: >1.00E+4nM. Assay description: Inhibition of CYP2C9 in human liver microsomes using midazolam as substrate preincubated for 15 mins followed by substrate addition and measured afte...
In DepthDetails ArticlePubMed
TargetSerine-protein kinase ATM(Homo sapiens (Human))
Astrazeneca
Curated by ChEMBL
LigandPNGBDBM60432(BDBM50468001 | US11236089, Compound AZD-6738 | US8...)
Affinity DataIC50: >3.00E+4nM. Assay description: Inhibition of ATM phosphorylation at Ser1981 residue in human HT-29 cells using ionizing radiation
In DepthDetails ArticlePubMed
TargetDNA-dependent protein kinase catalytic subunit(Homo sapiens (Human))
Astrazeneca
Curated by ChEMBL
LigandPNGBDBM60432(BDBM50468001 | US11236089, Compound AZD-6738 | US8...)
Affinity DataIC50: >3.00E+4nM. Assay description: Inhibition of DNA-PK phosphorylation at Ser2056 residue in human HT-29 cells using ionizing radiation
In DepthDetails ArticlePubMed
TargetSerine/threonine-protein kinase mTOR(Homo sapiens (Human))
Astrazeneca
Curated by ChEMBL
LigandPNGBDBM60432(BDBM50468001 | US11236089, Compound AZD-6738 | US8...)
Affinity DataIC50:  370nM. Assay description: Inhibition of mTOR (unknown origin)
In DepthDetails ArticlePubMed
TargetSerine/threonine-protein kinase ATR(Homo sapiens (Human))
Astrazeneca
US Patent
LigandPNGBDBM60432(BDBM50468001 | US11236089, Compound AZD-6738 | US8...)
Affinity DataIC50:  58.3nM. Assay description: ATM and ATR have distinct and overlapping responses to DNA damage. They must participate together and responses must be co-ordinated. Both pathways...
In DepthDetails US Patent