BDBM60437 US9067935, 122
SMILES Cc1c(nc2c(F)cccn12)N(Cc1ccc(OC(F)(F)F)cc1)S(=O)(=O)c1ccc(cc1)C([O-])=O
InChI Key InChIKey=LAZNIDOGPIBCHZ-UHFFFAOYSA-M
Data  1 IC50
  Tab Delimited (TSV)   2D SDfile   Computed 3D by Vconf -m prep SDfile
Find this compound or compounds like it in BindingDB:
Activity Spreadsheet -- Enzyme Inhibition Constant Data from BindingDB
Found 1 hit for monomerid = 60437
TargetTransient receptor potential M8 protein(Canis lupus familiaris (Dog))
Janssen Pharmaceutica
US Patent
LigandPNGBDBM60437(US9067935, 122)
Affinity DataIC50:  4.03nMT: 2°C. Assay description: The functional activity of compounds of the formula (I) was determined by measuring changes in intracellular calcium concentration using a Ca2+-sensi...
In DepthDetails US Patent