BDBM60600 US9120808, Example 13
SMILES COC(=O)C1N2[C@@H](CC2=O)O\C1=C(/C\C=C\c1ccccc1)C=O
InChI Key InChIKey=CRIIDFPLOBDCDK-IESOIDBDSA-N
Data  3 IC50
  Tab Delimited (TSV)   2D SDfile   Computed 3D by Vconf -m prep SDfile
Find this compound or compounds like it in BindingDB:
Activity Spreadsheet -- Enzyme Inhibition Constant Data from BindingDB
Found 3 hits for monomerid = 60600
TargetBeta-lactamase(Escherichia coli)
Nabriva Therapeutics
US Patent
LigandPNGBDBM60600(US9120808, Example 13)
Affinity DataIC50:  994nMpH: 7.0 T: 2°C. Assay description: The inhibitory concentrations (IC50, [uM]) of the beta -lactamase inhibitors against purified TEM-1, SHV-1 and AmpC beta -lactamases are assessed by ...
In DepthDetails US Patent
TargetBeta-lactamase TEM(Escherichia coli)
Nabriva Therapeutics
US Patent
LigandPNGBDBM60600(US9120808, Example 13)
Affinity DataIC50:  639nMpH: 7.0 T: 2°C. Assay description: The inhibitory concentrations (IC50, [uM]) of the beta -lactamase inhibitors against purified TEM-1, SHV-1 and AmpC beta -lactamases are assessed by ...
In DepthDetails US Patent
TargetBeta-lactamase SHV-1(Escherichia coli)
Nabriva Therapeutics
US Patent
LigandPNGBDBM60600(US9120808, Example 13)
Affinity DataIC50:  47.7nMpH: 7.0 T: 2°C. Assay description: The inhibitory concentrations (IC50, [uM]) of the beta -lactamase inhibitors against purified TEM-1, SHV-1 and AmpC beta -lactamases are assessed by ...
In DepthDetails US Patent