BDBM60611 (4E)-2-methoxy-4-[[[3-(1,4,5,6-tetrahydrocyclopenta[c]pyrazol-3-yl)-5-thioxo-1H-1,2,4-triazol-4-yl]amino]methylene]cyclohexa-2,5-dien-1-one::(4E)-2-methoxy-4-[[[5-sulfanylidene-3-(1,4,5,6-tetrahydrocyclopenta[c]pyrazol-3-yl)-1H-1,2,4-triazol-4-yl]amino]methylidene]-1-cyclohexa-2,5-dienone::(4E)-2-methoxy-4-[[[5-sulfanylidene-3-(1,4,5,6-tetrahydrocyclopenta[c]pyrazol-3-yl)-1H-1,2,4-triazol-4-yl]amino]methylidene]cyclohexa-2,5-dien-1-one::4-{[(E)-3-Mercapto-5-(1,4,5,6-tetrahydro-cyclopentapyrazol-3-yl)-[1,2,4]triazol-4-ylimino]-methyl}-2-methoxy-phenol::MLS000331417::SMR000220894::cid_16189647
SMILES COc1cc(C=Nn2c(n[nH]c2=S)-c2n[nH]c3CCCc23)ccc1O
InChI Key InChIKey=LNFRBMQLTYTZIF-DNJWFFQKSA-N
Data  5 IC50  1 EC50
  Tab Delimited (TSV)   2D SDfile   Computed 3D by Vconf -m prep SDfile
Find this compound or compounds like it in BindingDB:
Activity Spreadsheet -- Enzyme Inhibition Constant Data from BindingDB
Found 6 hits for monomerid = 60611
TargetSerine/threonine-protein kinase 33(Homo sapiens (Human))
Broad Institute
Curated by PubChem BioAssay
LigandPNGBDBM60611((4E)-2-methoxy-4-[[[3-(1,4,5,6-tetrahydrocyclopent...)
Affinity DataEC50:  1.04E+4nM. Assay description: Keywords: STK33 Kinase, Non-ATP Competitive Inhibitor Assay Overview: Purified STK33 Kinase is preincubated with potential inhibitors and allowed to ...
In DepthDetails PCBioAssay
TargetDNA dC->dU-editing enzyme APOBEC-3G(Homo sapiens (Human))
Burnham Center For Chemical Genomics
Curated by PubChem BioAssay
LigandPNGBDBM60611((4E)-2-methoxy-4-[[[3-(1,4,5,6-tetrahydrocyclopent...)
Affinity DataIC50:  1.56E+3nMT: 2°C. Assay description: Data Source: Sanford-Burnham Center for Chemical Genomics (SBCCG) Source Affiliation: Sanford-Burnham Medical Research Institute (SBMRI, San Diego, C...
In DepthDetails PCBioAssay
TargetDNA dC->dU-editing enzyme APOBEC-3A(Homo sapiens (Human))
Burnham Center For Chemical Genomics
Curated by PubChem BioAssay
LigandPNGBDBM60611((4E)-2-methoxy-4-[[[3-(1,4,5,6-tetrahydrocyclopent...)
Affinity DataIC50: >9.90E+4nMT: 2°C. Assay description: Data Source: Sanford-Burnham Center for Chemical Genomics (SBCCG) Source Affiliation: Sanford-Burnham Medical Research Institute (SBMRI, San Diego, C...
In DepthDetails PCBioAssay
TargetDNA dC->dU-editing enzyme APOBEC-3G(Homo sapiens (Human))
Burnham Center For Chemical Genomics
Curated by PubChem BioAssay
LigandPNGBDBM60611((4E)-2-methoxy-4-[[[3-(1,4,5,6-tetrahydrocyclopent...)
Affinity DataIC50:  732nMT: 2°C. Assay description: Data Source: Sanford-Burnham Center for Chemical Genomics (SBCCG) Source Affiliation: Sanford-Burnham Medical Research Institute (SBMRI, San Diego, C...
In DepthDetails PCBioAssay
TargetDNA dC->dU-editing enzyme APOBEC-3G(Homo sapiens (Human))
Burnham Center For Chemical Genomics
Curated by PubChem BioAssay
LigandPNGBDBM60611((4E)-2-methoxy-4-[[[3-(1,4,5,6-tetrahydrocyclopent...)
Affinity DataIC50:  808nMT: 2°C. Assay description: Data Source: Sanford-Burnham Center for Chemical Genomics (SBCCG) Source Affiliation: Sanford-Burnham Medical Research Institute (SBMRI, San Diego, C...
In DepthDetails PCBioAssay
TargetDNA dC->dU-editing enzyme APOBEC-3A(Homo sapiens (Human))
Burnham Center For Chemical Genomics
Curated by PubChem BioAssay
LigandPNGBDBM60611((4E)-2-methoxy-4-[[[3-(1,4,5,6-tetrahydrocyclopent...)
Affinity DataIC50: >1.00E+5nMT: 2°C. Assay description: Data Source: Sanford-Burnham Center for Chemical Genomics (SBCCG) Source Affiliation: Sanford-Burnham Medical Research Institute (SBMRI, San Diego, C...
In DepthDetails PCBioAssay